program: Gaussian 09
title: 000211547
version: EM64L-G09RevD.01
frameworkgroup: C1[X(C21H23N3O2)]
method: RPBEPBE
basis: SDD
operation: Freq
keyword: #p
keyword: freq=noraman
keyword: PBEPBE/SDD
title: #p freq=noraman PBEPBE/SDD
converged: YES YES NO NO
title: Mulliken charges:
elementType: O O N N N C C C C C C C C C C C C C C C C C C C C C H H H H H H H H H H H H H H H H H H H H H H H
charge: -0.284193 -0.268588 -0.208050 -0.084005 -0.034334 -0.348179 -0.362129 0.178753 0.131797 0.017677 -0.361095 0.333368 0.380669 -0.619701 -0.616070 -0.500824 -0.402641 -0.363104 -0.393097 0.335397 -0.236263 -0.240488 -0.244023 -0.373807 -0.237242 -0.536927 0.253999 0.235921 0.200350 0.253933 0.237990 0.221269 0.189304 0.236479 0.192944 0.224897 0.223963 0.290228 0.216571 0.288155 0.229846 0.223517 0.229159 0.226252 0.244075 0.230470 0.220708 0.220760 0.246310
chargesum: 0.00000
title: Mulliken charges with hydrogens summed into heavy atoms:
elementType: O O N N N C C C C C C C C C C C C C C C C C C C C C
charge: -0.284193 -0.268588 -0.208050 -0.084005 -0.034334 0.141740 0.092153 0.178753 0.131797 0.017677 -0.123105 0.333368 0.380669 0.027351 0.025733 -0.210595 -0.186070 -0.074950 -0.163250 0.335397 -0.012746 -0.011329 -0.017770 -0.129732 -0.006771 0.150850
polarizability: 4.16090429e+02 -1.61571777e+01 3.19043452e+02 -7.87668462e+00 -3.38857917e+01 1.48265784e+02
1716.lowfreq: -5.4551 -0.7304 -0.0005 0.0001 0.0007 6.3400 12.4079 17.1838 32.0408
frequency: 12.2270 17.0179 32.0304 37.5301 40.4483 61.3922 66.3574 83.3131 91.6476 96.8027 128.0726 152.7477 187.3533 201.1035 210.9102 215.8780 227.3783 238.2150 248.3773 260.6671 264.6131 286.8112 325.8490 332.6725 340.3553 377.5750 391.0208 401.3753 406.6119 427.2623 449.9074 459.7185 482.3273 535.0096 549.4564 569.3107 589.2220 600.9853 615.1223 628.3296 658.6916 666.3048 694.0527 694.5368 724.8368 749.0790 781.0499 785.2397 788.0920 817.7171 821.1065 844.9042 851.3330 870.0313 900.9443 917.8425 921.7661 930.8069 963.6941 975.2144 981.0816 988.2047 996.0405 999.0816 1014.0401 1024.3263 1030.1410 1037.4053 1056.6047 1073.0505 1086.8663 1089.5523 1094.2190 1100.9063 1111.9463 1124.9206 1142.0562 1155.4984 1175.1992 1183.6988 1199.1045 1204.5303 1225.5558 1237.0829 1262.3281 1272.8102 1288.7921 1296.9473 1314.6592 1319.9136 1327.3818 1334.4402 1358.8590 1369.0161 1383.2941 1394.3142 1418.1730 1421.9820 1434.3991 1436.1757 1441.7417 1445.3497 1462.7786 1467.6397 1470.2376 1470.3913 1476.9211 1477.2001 1483.0771 1484.4987 1487.4332 1489.7086 1557.8050 1578.5257 1583.1851 1598.9750 1610.6205 1620.0700 2854.3711 2860.7839 2877.4762 2958.5415 3020.2328 3024.3049 3046.2353 3052.0277 3058.3688 3079.4488 3083.2422 3123.2715 3125.3607 3131.9028 3132.8572 3133.5512 3146.0233 3154.9669 3162.3477 3164.4580 3171.4519 3180.3499 3188.6039
redmass: 4.6802 4.0471 4.4959 2.8315 3.8479 5.0529 4.6166 2.5003 4.3963 4.4751 4.2238 4.5956 2.7960 1.7915 2.0752 1.7002 2.4865 3.0050 1.9945 2.7461 1.6888 4.1015 4.3453 2.8906 5.7340 4.4158 4.1501 2.8075 2.9884 2.7036 3.4450 3.8798 4.9249 4.1458 4.7295 5.0959 7.3873 6.5808 6.0701 4.9282 6.3797 4.9940 1.8681 1.6950 5.0819 3.8426 2.0745 1.7706 1.4749 5.2621 4.8963 1.5144 3.2526 1.4579 1.5264 2.7812 1.5751 1.9502 1.3301 1.3887 5.7336 5.0873 1.8206 2.1854 3.2717 2.8501 2.3545 1.5751 2.5726 2.5106 1.5444 1.6421 1.4818 1.6831 1.2600 1.9950 1.6465 1.3793 1.0544 1.3297 1.3639 1.4753 2.8268 4.5606 2.5708 2.5681 1.4869 1.5142 1.4303 1.4604 1.3680 2.3890 2.8573 1.3226 5.7823 8.4663 2.4146 1.1397 1.1713 2.3543 1.3549 1.2346 1.0482 1.0503 1.0588 1.4771 1.0999 1.7159 1.5227 1.6620 1.0546 2.6102 6.2283 5.5562 5.9669 8.3841 5.9665 6.8659 1.0566 1.0609 1.0660 1.0331 1.0735 1.0727 1.1039 1.0790 1.0682 1.1004 1.1005 1.0851 1.0992 1.1072 1.0883 1.0864 1.0941 1.0927 1.0989 1.0909 1.0966 1.0919 1.0953
irintensity: 0.0470 0.4032 1.2002 0.1623 1.1841 0.5719 0.3260 1.7401 8.4667 0.4371 0.6874 0.7881 1.3881 0.5804 0.7838 3.3802 1.0132 3.3635 0.9294 3.2210 0.9347 0.6635 6.7430 12.9825 2.2310 3.3254 1.6153 0.3484 2.5599 0.5393 1.0221 2.3034 2.6352 24.5697 10.0677 6.3348 18.2041 18.8640 4.8933 8.6640 2.1411 0.9009 47.5335 30.6083 14.2394 8.9693 16.0902 71.3100 16.5524 14.1273 25.3833 6.1055 1.6145 1.3047 25.9653 6.7102 13.5845 4.0329 0.3900 2.4735 9.0677 0.7357 39.3689 45.7263 35.2001 9.5539 23.8835 28.5718 83.7117 11.3413 17.3384 8.2620 16.1519 18.5038 0.2095 58.6506 4.6691 2.1076 0.0123 46.1631 57.0274 26.4438 9.6825 40.7552 104.7871 23.4645 15.9350 3.2010 19.0777 12.7260 14.6886 11.3376 6.5927 10.2432 11.6657 15.1062 68.8910 1.3878 14.1090 13.1110 4.1155 13.1765 13.3343 13.1871 5.4546 10.1165 42.9606 68.7937 25.6137 42.3661 9.6168 1.1788 239.5122 5.7103 80.8943 94.0085 0.5212 84.7030 67.9016 132.6884 152.8898 81.7097 41.1528 49.2989 48.9591 7.1810 18.6831 21.4022 58.3002 4.2400 25.0135 2.9219 5.1109 8.5687 31.5523 13.6043 20.3704 25.3756 17.9868 3.0433 9.6467
temp: 298.150 k
press: 1.00000 atm
elementType: 8 8 7 7 7 6 6 6 6 6 6 6 6 6 6 6 6 6 6 6 6 6 6 6 6 6 1 1 1 1 1 1 1 1 1 1 1 1 1 1 1 1 1 1 1 1 1 1 1
symmnumber: 1
zpe: 1040160.1 jmol-1
zpe.correction: 0.396176 hartree
zpe.thermalcorrener: 0.420775 hartree
zpe.thermalcorrenthalpy: 0.421719 hartree
zpe.thermalcorrgfe: 0.338518 hartree
zpe.sumelectzpe: -1126.818597 hartree
zpe.sumelectthermal: -1126.793999 hartree
zpe.sumelectthermalent: -1126.793054 hartree
zpe.sumelectthermalfe: -1126.876255 hartree
dipole: -3.4373 -2.4231 1.6424
dipole: 4.5149
quadrupole: -128.4379 -134.7225 -155.9486
quadrupole: -1.0651 -0.2522 -1.8444
quadrupole: 11.2651 4.9805 -16.2456 -1.0651 -0.2522 -1.8444
hfenergy: -1127.2147734 hartree
pointgroup: C01 [X(C21H23N3O2)]
dipole: 1.2888802 -0.9958548 -0.7087152 debye
polarizability: 417.8800164|9.5272099|311.7823438|-3.3038463|45.6888165|153.7373046 unknown
InChI: InChI=1S/C21H23N3O2/c1-23(2)12-13-24-21(25)19(16-8-5-4-6-9-16)15-20(22-24)17-10-7-11-18(14-17)26-3/h4-11,14-15H,12-13H2,1-3H3
charge 0 multiplicity 1
49 atoms
O  -2.700985 1.602655 0.694482
O  5.579532 -0.658551 0.512751
N  -0.381664 1.350251 0.624675
N  -0.091629 5.101932 0.100382
N  0.794837 0.686244 0.401348
C  -0.226476 2.779207 0.985354
C  -0.346845 3.694009 -0.261338
C  -1.763591 -0.597175 0.104884
C  -1.710746 0.828711 0.487131
C  0.715358 -0.616544 0.045188
C  -0.556496 -1.269351 -0.087903
C  -3.070072 -1.284377 -0.06413
C  2.011323 -1.319171 -0.174808
C  -0.840169 6.071796 -0.722482
C  1.343237 5.433847 0.196107
C  3.21837 -0.714347 0.248926
C  2.066132 -2.591801 -0.812778
C  -4.231146 -0.874935 0.65294
C  -3.180879 -2.402195 -0.942644
C  4.457494 -1.362333 0.047186
C  3.305838 -3.231031 -1.006465
C  -5.445452 -1.580171 0.515144
C  -4.396866 -3.099659 -1.083125
C  4.513507 -2.632932 -0.580983
C  -5.536735 -2.695515 -0.348314
C  6.893364 -1.278508 0.327553
H  -1.019422 3.049278 1.698634
H  0.762579 2.879024 1.457335
H  0.352173 3.322261 -1.05185
H  -1.375828 3.604581 -0.651445
H  -0.575591 -2.340139 -0.306034
H  -0.700446 7.088739 -0.312501
H  -0.521726 6.089148 -1.795639
H  -1.917981 5.836212 -0.687023
H  1.86955 5.3883 -0.791313
H  1.462052 6.454478 0.601929
H  1.856008 4.738447 0.883141
H  3.198219 0.263377 0.736497
H  1.156574 -3.078986 -1.176524
H  -4.174176 0.001186 1.302135
H  -2.320404 -2.70702 -1.549388
H  3.338594 -4.208409 -1.500503
H  -6.324667 -1.252195 1.080625
H  -4.46041 -3.948471 -1.773092
H  5.463792 -3.150517 -0.740141
H  -6.483899 -3.235424 -0.457765
H  7.117109 -1.436892 -0.745606
H  6.964915 -2.242859 0.867677
H  7.610645 -0.561873 0.753574
