program: Gaussian 09
title: 000015221
version: EM64L-G09RevD.01
frameworkgroup: C1[X(C4H6Br4)]
method: RPBEPBE
basis: SDD
operation: Freq
keyword: #pfreq=noraman
keyword: PBEPBE/SDD
title: #p freq=noraman PBEPBE/SDD
converged: NO YES NO NO
title: Mulliken charges:
elementType: Br Br Br Br C C C C H H H H H H
charge: 0.041672 0.041128 0.047745 0.047652 -0.404165 -0.403806 -0.651377 -0.651526 0.357032 0.357198 0.303933 0.305214 0.305214 0.304086
chargesum: 0.00000
title: Mulliken charges with hydrogens summed into heavy atoms:
elementType: Br Br Br Br C C C C
charge: 0.041672 0.041128 0.047745 0.047652 -0.047133 -0.046608 -0.042230 -0.042225
polarizability: 1.41196678e+02 -8.22395979e+00 1.16580552e+02 1.12101589e-02 1.31930848e-02 6.24041088e+01
1716.lowfreq: -5.7422 -5.2957 -0.0001 0.0002 0.0002 5.5923 35.5168 42.1786 63.7118
frequency: 35.5082 42.1594 63.7116 103.5010 119.3130 148.1429 174.2802 199.1777 295.8425 341.1960 446.2339 516.1846 582.2386 628.5457 723.3255 869.8279 889.8174 897.9300 1043.6033 1089.7352 1108.6056 1149.7402 1209.8944 1214.8073 1225.0604 1245.9343 1303.5049 1351.5632 1425.5333 1426.0841 3044.7684 3047.6803 3096.2728 3103.2759 3135.3201 3137.5387
redmass: 50.7549 15.2098 24.6095 46.1656 6.1550 10.4054 13.7868 2.9734 3.3613 3.9241 7.3840 4.1011 3.4665 5.2319 4.3681 1.5066 1.6643 3.3903 2.8106 1.5130 1.0564 1.7198 1.1874 1.2232 1.1741 1.1780 1.2622 1.3378 1.0949 1.0945 1.0566 1.0572 1.0871 1.0887 1.1082 1.1075
irintensity: 0.0244 1.1140 0.0657 0.2232 3.7994 1.6826 0.2601 3.5462 1.0374 12.5541 19.8454 57.4603 6.8286 4.4874 51.9757 54.1521 0.6007 0.2546 6.4461 0.6506 11.7689 3.8205 24.3452 9.9730 1.3100 28.9427 0.6420 2.8127 0.9907 20.3209 13.9079 3.1433 2.1390 0.0765 1.7666 1.2531
temp: 298.150 k
press: 1.00000 atm
elementType: 35 35 35 35 6 6 6 6 1 1 1 1 1 1
symmnumber: 1
zpe: 241860.1 jmol-1
zpe.correction: 0.092120 hartree
zpe.thermalcorrener: 0.102774 hartree
zpe.thermalcorrenthalpy: 0.103719 hartree
zpe.thermalcorrgfe: 0.050272 hartree
zpe.sumelectzpe: -209.220291 hartree
zpe.sumelectthermal: -209.209636 hartree
zpe.sumelectthermalent: -209.208692 hartree
zpe.sumelectthermalfe: -209.262138 hartree
dipole: 0.0026 0.0021 0.9754
dipole: 0.9755
quadrupole: -98.1990 -88.4185 -83.9996
quadrupole: 1.1286 -0.0031 0.0059
quadrupole: -7.9933 1.7872 6.2061 1.1286 -0.0031 0.0059
hfenergy: -209.3124102 hartree
pointgroup: C01 [X(C4H6Br4)]
dipole: -0.0013654 0.0047162 0.3837409 debye
dipolederiv: -0.2110693 0.1613374 -0.0013902 0.1531521 -0.5956914 0.1242885 -0.0063552 0.0757124 -0.1309184 -0.2115088 0.1615023 -0.0033935 0.1539784 -0.6016298 -0.1104196 0.0016771 -0.0617917 -0.1258596 -0.4926735 -0.0527947 0.0866175 -0.0611731 -0.0621587 0.0054457 0.0082661 -0.01347 -0.1048265 -0.4921845 -0.0558136 -0.0855314 -0.0624646 -0.0623815 -0.0070439 -0.0068245 0.012194 -0.1051244 0.0720089 -0.3001092 -0.0094704 -0.1668706 0.7669139 -0.2924603 -0.2396122 -0.1861323 0.0944287 0.0722766 -0.3007986 0.0183325 -0.1629932 0.7817353 0.2723061 0.2444509 0.1661632 0.0814921 0.7062356 0.2020148 -0.0441366 0.0747382 -0.113032 0.09445 0.0587434 0.0347067 0.0137352 0.7057792 0.2047082 0.0391458 0.0750684 -0.1157316 -0.0899987 -0.0600687 -0.0307824 0.0167734 0.017616 0.0312228 -0.0373117 0.0046708 -0.0526353 -0.0138531 0.0029268 0.0142599 0.0239127 0.0173371 0.0324567 0.0362327 0.0047266 -0.0525605 0.0160134 -0.003176 -0.0121245 0.0241206 -0.061534 -0.0687437 -0.0615899 -0.0339967 0.0580839 -0.0818958 -0.0462075 -0.0408477 0.0221293 -0.0301482 0.0259127 -0.0244376 0.0268528 -0.004676 0.0377423 -0.017373 0.0606097 0.0840185 -0.0308234 0.0265145 0.0238973 0.0273039 -0.0073382 -0.0353947 0.0167993 -0.058213 0.0868116 -0.0613117 -0.0674097 0.0630356 -0.032993 0.0611019 0.08082 0.0467534 0.0397157 0.0193068 unknown
polarizability: 140.2973631|-9.4302999|117.468079|0.1824074|-0.8049571|62.4158967 unknown
InChI: InChI=1S/C4H6Br4/c5-1-3(7)4(8)2-6/h3-4H,1-2H2
charge 0 multiplicity 1
14 atoms
Br -1.127231 2.068981 -0.751592
Br 1.132928 -2.111058 -0.688811
Br -3.471316 -0.503454 0.566718
Br 3.472449 0.503203 0.557542
C  -0.766223 0.073565 -0.450635
C  0.769791 -0.107436 -0.446077
C  -1.474494 -0.411034 0.813728
C  1.475522 0.412221 0.805924
H  -1.188078 -0.393648 -1.353423
H  1.193901 0.33334 -1.361028
H  -1.312088 0.247728 1.679087
H  -1.168282 -1.445674 1.040069
H  1.166605 1.451546 1.005208
H  1.314517 -0.224381 1.68799
