program: Gaussian 09
title: 000211544
version: EM64L-G09RevD.01
frameworkgroup: C1[X(C24H27N3O2)]
method: RPBEPBE
basis: SDD
operation: Freq
keyword: #p
keyword: freq=noraman
keyword: PBEPBE/SDD
title: #p freq=noraman PBEPBE/SDD
converged: YES YES NO NO
title: Mulliken charges:
elementType: O O N N N C C C C C C C C C C C C C C C C C C C C C C C C H H H H H H H H H H H H H H H H H H H H H H H H H H H
charge: -0.286370 -0.268279 -0.076745 -0.205739 -0.029344 -0.371554 -0.365416 -0.385333 -0.391599 -0.399238 -0.346662 -0.379624 0.122683 0.183200 0.017174 -0.363815 0.332687 0.382479 -0.362687 -0.392609 -0.502146 -0.403650 0.335315 -0.235221 -0.240322 -0.243798 -0.373723 -0.237089 -0.536741 0.168298 0.212621 0.227288 0.176853 0.190495 0.202879 0.203884 0.192282 0.212790 0.188809 0.222101 0.221911 0.249998 0.246790 0.240016 0.287418 0.230090 0.290267 0.218272 0.223544 0.228933 0.226310 0.243993 0.230507 0.220539 0.220679 0.246599
chargesum: 0.00000
title: Mulliken charges with hydrogens summed into heavy atoms:
elementType: O O N N N C C C C C C C C C C C C C C C C C C C C C C C C
charge: -0.286370 -0.268279 -0.076745 -0.205739 -0.029344 0.009365 0.038726 0.008042 0.004567 0.002362 0.097349 0.117165 0.122683 0.183200 0.017174 -0.123800 0.332687 0.382479 -0.075269 -0.162519 -0.211880 -0.185379 0.335315 -0.011677 -0.011389 -0.017488 -0.129730 -0.006582 0.151075
polarizability: 3.68452303e+02 -3.12683532e+01 4.26107068e+02 3.89223988e+01 9.96629635e+00 1.75062388e+02
1716.lowfreq: -23.6067 -18.1362 -0.0007 -0.0006 0.0002 0.6106 2.5218 4.9716 14.4502
frequency: -22.3165 -15.2680 14.4103 25.3146 39.3393 55.2948 57.6442 67.7122 83.5822 92.0395 103.7817 130.2043 153.3823 188.1638 199.3903 217.0434 229.0748 237.1163 241.2313 253.8561 261.9315 283.8690 304.5698 337.7768 341.7552 348.5336 378.5026 388.0930 395.5591 401.7105 432.8240 446.2266 448.8336 457.7742 480.3954 530.8207 538.4591 554.3803 568.3557 596.2673 607.8918 614.5375 627.6471 659.1928 665.7361 693.7008 693.9678 723.8221 746.5462 756.7476 781.2059 784.7733 791.3588 803.9094 818.3546 842.0990 846.8972 852.6591 855.4056 870.1868 899.2696 903.1213 917.5894 920.0504 930.5879 956.0788 963.7587 974.1168 980.7296 988.1604 992.6134 995.7961 998.5310 1011.3097 1029.4877 1037.9511 1046.9322 1065.5711 1073.3256 1088.6192 1099.4067 1102.7178 1111.4524 1112.0847 1120.7158 1147.2221 1151.9068 1155.7309 1160.4604 1174.9691 1183.3880 1199.0526 1204.5329 1224.6863 1239.4671 1258.3794 1262.4397 1265.3058 1286.8284 1293.2954 1295.0125 1310.4792 1317.1392 1325.9889 1331.5631 1334.2129 1338.6010 1345.7487 1353.0844 1358.8016 1372.8099 1382.9343 1389.7355 1394.2843 1418.8470 1434.8004 1435.9265 1442.6027 1450.0903 1460.2866 1464.7067 1467.2197 1468.4830 1469.7374 1476.0733 1476.9509 1482.9484 1484.1406 1489.2066 1557.1535 1578.0404 1583.1532 1599.0668 1610.4882 1620.0668 2826.6582 2836.9180 2901.3154 2958.5858 2966.8041 2984.6853 2987.0031 3024.0028 3032.4389 3037.3610 3040.2532 3046.0219 3046.1070 3055.2552 3061.1930 3122.3676 3125.5340 3132.0960 3132.6925 3135.8507 3145.1914 3153.2652 3161.0666 3162.4844 3170.3364 3179.0181 3187.8761
redmass: 2.7980 4.7843 4.7956 4.9888 3.7827 4.7923 3.8842 4.8964 4.0554 4.0067 4.9306 4.0827 5.3341 3.1279 1.7141 5.1703 2.4927 3.1820 2.7409 4.6168 1.7039 3.9294 2.4942 5.3685 3.4844 3.7817 2.4865 4.3873 2.8925 2.8337 3.9428 3.4051 3.1404 3.6207 4.3519 2.8003 3.3793 3.7582 4.8718 6.4154 4.5405 5.9933 4.9383 5.9451 4.9036 1.7372 1.8366 4.9827 3.7970 2.8099 2.2976 1.7162 1.6930 1.4914 4.9493 2.1199 1.9077 2.2843 1.7055 1.4495 2.3606 1.5080 2.4766 1.6628 1.9957 1.3161 1.3307 1.3907 5.7253 5.1349 2.5144 1.8803 1.9916 3.6127 2.3714 3.4306 2.1844 1.8103 2.5583 1.6387 1.6377 1.9741 1.2593 2.3259 2.5452 1.2794 1.5820 1.4160 2.3480 1.0542 1.3024 1.3108 1.5544 2.3804 4.0280 1.2667 2.6038 1.1888 1.4628 1.4128 1.4202 1.3225 1.5526 1.3841 1.3144 2.1979 1.4169 1.4788 1.4466 2.7498 1.3977 5.7427 1.4147 7.3677 2.3468 1.2217 2.1867 1.4749 1.0916 1.0887 1.0846 1.0507 1.0997 1.5396 1.2445 1.4630 1.5073 1.6675 2.6305 6.2947 5.5655 6.0260 8.3485 5.9738 6.8604 1.0715 1.0703 1.0688 1.0331 1.0623 1.0613 1.0613 1.0884 1.0950 1.0909 1.0892 1.1032 1.1039 1.1033 1.0581 1.0854 1.0991 1.0882 1.0865 1.1072 1.0941 1.0927 1.0927 1.0972 1.0967 1.0921 1.0953
irintensity: 0.1616 0.3108 0.0304 1.1775 0.1735 0.1773 1.4099 0.2337 1.1936 7.4074 0.2672 0.2279 0.8558 0.0860 0.4407 2.2802 3.0352 2.3217 2.9085 2.1259 0.8672 0.1822 3.7334 2.6085 2.3095 4.7777 6.0779 6.0956 2.4961 0.3431 0.9269 0.3878 1.1524 2.8285 3.0046 13.3259 22.9807 10.2343 4.8956 18.4990 12.5028 5.5517 8.5492 1.6501 1.1124 56.0524 22.3618 14.3179 3.8173 12.5634 22.8667 62.2998 12.2522 1.9329 26.3728 10.3091 0.0558 4.1726 11.5083 0.9180 4.7424 29.8479 9.6580 9.9673 4.1701 3.0070 0.4813 2.3365 8.8778 0.7761 21.7321 43.6904 40.7321 52.4528 22.8940 17.4631 9.6070 10.8605 8.6727 8.9235 19.8316 21.8564 0.2078 18.3034 14.2171 18.9975 15.1521 9.0020 42.1437 0.0152 43.2326 50.9893 36.2068 15.0826 64.3218 4.2580 85.7904 5.3168 29.5915 10.7507 2.3502 24.9464 6.1627 10.3867 4.7382 12.0802 1.5868 7.1578 6.4010 6.9131 20.8195 10.8644 2.7806 13.1346 65.0935 31.6686 7.5032 10.8528 6.6922 12.4250 7.7844 13.0605 10.5404 10.9090 22.7968 52.6526 24.0677 44.2817 1.3463 249.4447 6.5966 76.5082 100.3740 0.6906 85.3935 50.7527 137.1800 61.7966 82.4245 40.8414 37.0687 35.9550 40.9322 83.2343 26.6215 19.0268 13.5793 52.3576 92.9177 22.4843 4.7097 24.9804 5.1887 7.8062 2.5694 30.5553 12.6640 0.1784 47.6951 17.8302 2.8826 9.7751
temp: 298.150 k
press: 1.00000 atm
elementType: 8 8 7 7 7 6 6 6 6 6 6 6 6 6 6 6 6 6 6 6 6 6 6 6 6 6 6 6 6 1 1 1 1 1 1 1 1 1 1 1 1 1 1 1 1 1 1 1 1 1 1 1 1 1 1 1
symmnumber: 1
zpe: 1210514.8 jmol-1
zpe.correction: 0.461061 hartree
zpe.thermalcorrener: 0.485507 hartree
zpe.thermalcorrenthalpy: 0.486451 hartree
zpe.thermalcorrgfe: 0.405400 hartree
zpe.sumelectzpe: -1243.322047 hartree
zpe.sumelectthermal: -1243.297601 hartree
zpe.sumelectthermalent: -1243.296657 hartree
zpe.sumelectthermalfe: -1243.377708 hartree
dipole: 3.4705 -1.2817 1.4863
dipole: 3.9870
quadrupole: -142.8459 -150.3992 -173.1128
quadrupole: -5.1022 4.6701 0.3969
quadrupole: 12.6067 5.0535 -17.6602 -5.1022 4.6701 0.3969
hfenergy: -1243.7831076 hartree
pointgroup: C01 [X(C24H27N3O2)]
dipole: 0.8942427 -1.1614983 0.5583763 debye
polarizability: 352.5271605|8.0649434|438.9708565|46.364989|3.6580439|178.123742 unknown
InChI: InChI=1S/C24H27N3O2/c1-29-21-12-8-11-20(17-21)23-18-22(19-9-4-2-5-10-19)24(28)27(25-23)16-15-26-13-6-3-7-14-26/h2,4-5,8-12,17-18H,3,6-7,13-16H2,1H3
charge 0 multiplicity 1
56 atoms
O  -0.607205 2.604883 -0.485066
O  0.905318 -5.836019 -0.925814
N  -4.323504 0.520502 0.04737
N  -0.584834 0.270485 -0.532313
N  -0.035347 -0.975341 -0.391309
C  -5.289859 -0.166394 0.940557
C  -4.657529 1.959727 -0.117972
C  -6.722575 -0.06075 0.37661
C  -6.067451 2.13289 -0.716728
C  -7.121263 1.417928 0.160307
C  -2.908256 0.305728 0.413619
C  -2.029432 0.276057 -0.86391
C  0.067085 1.53353 -0.338554
C  1.496706 1.427113 0.017484
C  1.275093 -1.041452 -0.062216
C  2.050509 0.15176 0.129145
C  2.310868 2.649474 0.242691
C  1.855032 -2.408177 0.06531
C  2.007939 3.88236 -0.404071
C  3.445421 2.602956 1.105205
C  1.157431 -3.518655 -0.465467
C  3.102145 -2.625229 0.718826
C  1.690889 -4.822422 -0.355137
C  3.625888 -3.928223 0.822668
C  2.830292 5.013017 -0.213999
C  4.260297 3.735894 1.298166
C  2.9356 -5.040246 0.289092
C  3.960152 4.948277 0.632802
C  1.409665 -7.209037 -0.852893
H  -5.272863 0.269582 1.975116
H  -4.992913 -1.22852 1.024886
H  -3.9005 2.431258 -0.770062
H  -4.608808 2.490717 0.869634
H  -7.428361 -0.558995 1.069227
H  -6.761702 -0.599053 -0.590169
H  -6.077326 1.701874 -1.736486
H  -6.299801 3.211765 -0.804593
H  -8.12379 1.484533 -0.303308
H  -7.18469 1.927733 1.144313
H  -2.807435 -0.665079 0.933071
H  -2.524864 1.096886 1.100842
H  -2.227173 1.172365 -1.470764
H  -2.241488 -0.631839 -1.447113
H  3.121867 0.053301 0.322939
H  1.122787 3.946309 -1.040212
H  3.671817 1.684383 1.658701
H  0.197541 -3.373588 -0.967238
H  3.654696 -1.793104 1.165542
H  4.583517 -4.087054 1.330757
H  2.582876 5.94967 -0.725744
H  5.120006 3.678593 1.97503
H  3.364632 -6.042206 0.379981
H  4.591408 5.831239 0.782718
H  1.521052 -7.543884 0.197006
H  2.378179 -7.312272 -1.380245
H  0.647157 -7.820654 -1.356934
