program: Gaussian 09
title: 000211543
version: EM64L-G09RevD.01
frameworkgroup: C1[X(C14H21N3O)]
method: RPBEPBE
basis: SDD
operation: Freq
keyword: #p
keyword: freq=noraman
keyword: PBEPBE/SDD
title: #p freq=noraman PBEPBE/SDD
converged: YES YES NO NO
title: Mulliken charges:
elementType: O N N N C C C C C C C C C C C C C C H H H H H H H H H H H H H H H H H H H H H
charge: -0.247491 -0.203082 -0.038111 -0.473001 -0.166287 -0.489128 -0.443761 0.136233 -0.607248 -0.607693 0.169786 0.356553 0.349338 -0.417880 -0.428736 -0.824734 -0.826481 -0.235011 0.245335 0.256292 0.235842 0.232055 0.234993 0.211649 0.243372 0.222017 0.223237 0.201451 0.234870 0.361615 0.231349 0.231106 0.290431 0.217000 0.212732 0.231994 0.232443 0.222939 0.224012
chargesum: 0.00000
title: Mulliken charges with hydrogens summed into heavy atoms:
elementType: O N N N C C C C C C C C C C C C C C
charge: -0.247491 -0.203082 -0.038111 -0.111386 0.079048 0.003006 0.023286 0.136233 0.069790 0.051865 0.169786 0.356553 0.349338 -0.186530 -0.197630 -0.104572 -0.139106 -0.010998
polarizability: 2.24551230e+02 3.02897127e+00 1.79551738e+02 4.47180619e+00 -1.83428488e+00 1.21081648e+02
1716.lowfreq: -14.8786 -12.0851 -0.0006 0.0004 0.0006 4.2341 19.2842 46.0443 53.3635
frequency: 19.1369 45.9661 53.3529 59.2846 108.9196 110.6867 151.2918 154.8548 174.7557 188.1882 205.1109 214.4807 225.5597 229.3813 245.9078 285.2275 294.6213 315.1753 336.2651 373.7003 430.6251 467.6598 473.4251 499.5550 515.8960 521.3513 539.9247 557.9620 607.6218 633.2184 678.8349 708.7586 726.2789 762.2419 776.2954 829.6577 832.6367 848.7426 861.0636 896.8808 899.1711 927.4015 960.6156 972.8075 986.4111 992.7208 1002.0036 1017.3849 1039.1996 1045.6097 1053.4935 1072.9013 1097.2834 1109.7192 1114.9438 1134.1144 1164.2620 1176.2824 1176.8233 1184.4471 1190.6153 1226.2774 1241.0779 1260.5020 1266.6928 1277.4931 1296.3677 1304.9367 1311.4895 1369.7022 1395.5847 1397.8372 1416.0207 1420.2761 1434.5450 1451.5465 1454.4804 1459.0167 1459.7607 1466.9879 1469.3519 1471.3066 1475.1494 1476.9001 1481.3296 1487.6511 1493.5015 1600.8142 1603.3222 1626.2610 2911.0738 2934.4415 2964.5322 2966.5248 2975.0430 3001.0733 3027.4202 3038.9600 3044.5379 3046.9569 3056.0269 3081.6222 3085.6836 3086.2421 3100.1599 3106.8439 3107.9719 3119.9380 3129.8828 3155.6179 3282.2390
redmass: 3.2458 4.2606 3.4255 4.4650 4.0343 4.3572 1.0521 2.4590 1.6611 1.6095 1.1308 1.4128 1.7514 2.7232 2.6208 3.7801 2.7966 3.0738 3.6556 2.8607 3.6960 3.3144 3.4805 3.9618 3.0969 4.4650 4.3068 3.4758 2.9296 5.0191 4.6690 4.6092 4.2008 4.7419 1.2286 3.2037 1.8901 1.8454 2.0409 1.3119 2.5022 2.4487 2.8947 1.3557 1.6129 2.4852 2.2057 2.3134 1.6692 1.7131 1.5961 2.3968 1.6918 1.4256 1.3723 1.9877 2.3580 1.3033 1.7899 1.7685 2.9815 2.2603 1.8069 1.6603 1.4326 2.4466 1.3358 1.3740 1.2365 6.3601 1.2769 1.2397 1.1495 1.2083 1.9558 1.6108 1.1390 1.0697 1.0796 1.1273 1.0872 1.0930 1.1613 1.3384 1.1445 1.1991 1.5468 7.0121 5.6244 7.6770 1.0494 1.0450 1.0396 1.0839 1.0367 1.0646 1.0642 1.0949 1.0809 1.0886 1.0966 1.1009 1.0981 1.0996 1.1007 1.1007 1.1017 1.0856 1.0919 1.0995 1.0758
irintensity: 0.6873 1.4018 1.3866 0.8440 1.5003 1.8428 0.7744 0.2263 4.0784 1.0339 2.2431 2.9464 1.6482 2.3928 10.8690 1.6069 6.7955 3.4186 3.7703 3.2253 9.7594 0.8367 1.5154 13.7423 0.3788 1.0224 1.2386 0.4201 5.7579 34.9731 1.0385 2.4803 6.8864 1.3228 56.6867 1.1080 17.2298 33.5859 20.4965 0.1140 2.3525 6.9422 9.2483 0.8770 5.9794 6.7540 7.6864 5.6522 6.7241 2.7280 9.3082 8.0011 16.7398 2.2744 3.1916 11.1234 6.8388 2.9613 0.9215 1.6075 3.5985 2.2782 2.4353 1.9510 6.1418 1.0064 2.3857 1.7907 1.8950 15.2782 13.6275 20.9493 4.0121 23.0300 30.3544 25.1113 29.3159 4.3771 24.0776 5.7560 5.2836 18.7799 46.8804 203.7129 15.7062 30.3126 248.2734 12.5281 18.8693 176.6354 80.8949 74.3072 34.5268 22.7176 28.9119 51.1591 13.0045 18.4408 49.4306 37.8965 14.3149 16.9242 25.1751 24.3380 33.0611 11.6427 29.7559 0.3502 27.4274 37.9403 256.7195
temp: 298.150 k
press: 1.00000 atm
elementType: 8 7 7 7 6 6 6 6 6 6 6 6 6 6 6 6 6 6 1 1 1 1 1 1 1 1 1 1 1 1 1 1 1 1 1 1 1 1 1
symmnumber: 1
zpe: 864886.2 jmol-1
zpe.correction: 0.329418 hartree
zpe.thermalcorrener: 0.347920 hartree
zpe.thermalcorrenthalpy: 0.348864 hartree
zpe.thermalcorrgfe: 0.282474 hartree
zpe.sumelectzpe: -784.172601 hartree
zpe.sumelectthermal: -784.154099 hartree
zpe.sumelectthermalent: -784.153155 hartree
zpe.sumelectthermalfe: -784.219545 hartree
dipole: -2.3915 1.9891 1.5447
dipole: 3.4730
quadrupole: -99.9571 -104.7816 -113.2822
quadrupole: 2.5347 4.9723 -7.5412
quadrupole: 6.0499 1.2254 -7.2752 2.5347 4.9723 -7.5412
hfenergy: -784.502019 hartree
pointgroup: C01[X(C14H21N3O1)]
dipole: 0.9509235 0.9379697 -0.2881095 debye
polarizability: 224.4120704|-4.8013598|168.985653|-1.0855739|22.9645744|131.7868937 unknown
InChI: InChI=1S/C14H21N3O/c1-10-6-5-7-11(2)13(10)15-14(18)12-8-9-16(3)17(12)4/h5-7,12,15H,8-9H2,1-4H3
charge 0 multiplicity 1
39 atoms
O  0.048026 -2.359591 0.515172
N  2.340167 0.16809 -1.000638
N  3.518451 0.753787 -0.303755
N  -0.221457 -0.146735 -0.282981
C  1.997556 -1.159502 -0.35383
C  2.91463 -1.255589 0.898309
C  4.120911 -0.386089 0.464409
C  0.499406 -1.291697 0.002071
C  2.611954 0.05435 -2.456772
C  3.085621 1.882823 0.56199
C  -1.612936 0.101203 -0.039747
C  -2.616903 -0.779139 -0.541831
C  -1.958476 1.28689 0.677894
C  -3.972951 -0.466084 -0.269883
C  -3.324081 1.567834 0.912218
C  -2.273861 -1.995981 -1.375743
C  -0.880226 2.222803 1.195255
C  -4.330815 0.691372 0.451721
H  2.239158 -1.995912 -1.043184
H  3.180606 -2.298706 1.127786
H  2.413377 -0.829622 1.78505
H  4.716657 -0.001365 1.308875
H  4.791748 -0.956304 -0.204885
H  3.477892 -0.604869 -2.684378
H  2.818771 1.056551 -2.863282
H  1.712072 -0.353021 -2.952883
H  3.985867 2.349732 0.99928
H  2.394116 1.592904 1.386439
H  2.578904 2.632192 -0.067343
H  0.405543 0.614226 -0.608038
H  -4.753197 -1.137816 -0.646613
H  -3.595573 2.472493 1.468837
H  -1.821574 -2.78498 -0.747946
H  -3.17406 -2.398955 -1.870291
H  -1.529202 -1.749325 -2.156346
H  -1.319722 3.022511 1.814804
H  -0.137004 1.680082 1.809326
H  -0.321831 2.712404 0.372463
H  -5.385763 0.914439 0.645972
