program: Gaussian 09
title: 000211542
version: EM64L-G09RevD.01
frameworkgroup: C1[X(C22H23N3O2)]
method: RPBEPBE
basis: SDD
operation: Freq
keyword: #p
keyword: freq=noraman
keyword: PBEPBE/SDD
title: #p freq=noraman PBEPBE/SDD
converged: YES YES NO NO
title: Mulliken charges:
elementType: O O N N N C C C C C C C C C C C C C C C C C C C C C C H H H H H H H H H H H H H H H H H H H H H H H
charge: -0.247670 -0.284623 -0.094642 -0.207125 -0.039296 -0.351046 -0.338065 -0.351477 -0.362504 -0.318694 -0.314339 0.137117 0.176742 0.019783 -0.363687 0.333447 0.347449 -0.362272 -0.391212 -0.376841 -0.371215 -0.239813 -0.243204 -0.246703 -0.230592 -0.236242 -0.238351 0.199501 0.254112 0.197781 0.205062 0.220406 0.192108 0.252901 0.237114 0.192908 0.213746 0.214098 0.193733 0.241271 0.287981 0.229827 0.218040 0.267181 0.229951 0.227301 0.227997 0.228780 0.231500 0.231774
chargesum: 0.00000
title: Mulliken charges with hydrogens summed into heavy atoms:
elementType: O O N N N C C C C C C C C C C C C C C C C C C C C C C
charge: -0.247670 -0.284623 -0.094642 -0.207125 -0.039296 0.102566 0.064778 0.061037 0.127511 0.087960 0.093493 0.137117 0.176742 0.019783 -0.122416 0.333447 0.347449 -0.074291 -0.161385 -0.158800 -0.104034 -0.009862 -0.015903 -0.018705 -0.001812 -0.004741 -0.006577
polarizability: 3.33665665e+02 1.35261829e+01 3.89962658e+02 -3.93400253e+01 6.57210955e+00 1.55677184e+02
1716.lowfreq: -7.5440 -4.0194 -0.0010 -0.0007 -0.0006 1.9465 12.4637 17.7088 24.1999
frequency: 11.3596 17.6658 24.1651 25.8169 43.0892 58.4577 69.4305 76.0261 84.9994 111.6585 130.2744 171.3052 197.5924 232.8247 237.3522 245.1207 262.3107 270.8581 318.9735 322.5971 337.2675 367.1026 372.8256 394.8024 400.6089 401.7009 405.3044 437.3383 466.6360 474.2260 489.9674 541.4958 568.9177 595.1052 613.3464 614.6575 617.6481 626.9889 646.4275 666.1984 694.1671 697.2585 741.3344 753.4214 770.0514 779.5824 784.9913 793.2769 808.1831 839.5176 840.5952 847.0007 850.4301 895.0593 904.0849 911.3393 926.8049 929.5573 975.1761 980.0230 988.2655 989.1099 996.3098 997.9352 1000.2553 1004.5915 1023.9438 1026.8026 1029.8842 1041.6376 1053.0331 1072.0063 1077.6063 1085.1456 1089.6320 1094.2252 1107.8023 1131.7063 1139.6587 1173.7241 1175.3808 1189.8019 1192.3305 1194.9069 1201.9034 1235.9792 1244.9833 1255.1200 1271.7376 1287.2168 1296.6737 1312.0036 1316.9266 1319.4645 1324.7694 1333.4115 1337.1877 1346.8065 1364.1289 1364.6019 1370.3971 1381.5655 1385.8704 1387.9894 1421.5301 1436.1937 1439.4996 1442.1856 1448.3429 1450.3263 1459.7681 1473.0182 1481.9797 1483.7085 1493.4416 1557.9714 1578.0459 1586.7827 1599.9587 1609.9087 1614.2458 2865.7354 2871.8255 2888.8106 2954.3097 2959.0178 3030.6734 3036.5977 3051.7659 3058.0624 3080.9314 3084.7839 3123.1635 3126.3889 3131.3038 3133.1099 3134.1539 3146.1188 3146.9064 3159.4264 3161.3580 3162.9119 3171.5225 3188.4003
redmass: 4.2512 3.6030 4.4259 4.3994 3.9699 4.2557 5.2020 6.4611 4.4765 5.0582 4.6903 4.9828 3.5177 2.2257 4.1730 3.3467 5.6478 3.7863 2.4907 4.1617 6.1664 3.8287 3.3208 2.4502 2.8533 2.8651 4.7718 5.2453 3.0166 4.3947 3.7173 4.0165 3.7066 6.0615 4.2315 5.2675 3.6836 5.2420 4.7226 5.3594 1.7095 1.7662 3.3311 4.0415 3.8711 2.0370 2.5262 1.4894 3.4248 2.0692 2.2174 1.4328 1.3745 2.5611 1.6653 3.2501 1.4726 1.5808 1.3894 1.3964 5.2317 5.7864 2.1872 1.6049 1.3838 2.3874 2.8850 2.2353 2.1658 3.7597 2.0174 2.8429 2.9705 1.6639 1.6874 2.4527 2.4438 2.6388 2.5907 1.0550 1.0545 1.2783 1.1574 1.5372 1.1547 3.9563 1.5102 2.3855 1.3007 1.3996 1.3400 1.3334 1.5019 1.3191 1.4538 1.3758 1.9115 1.2965 1.4559 3.0130 1.2692 6.6363 4.2933 1.4952 2.4685 2.1241 1.3046 1.0827 1.0841 1.0975 1.0983 4.1243 2.3049 1.0976 2.6188 6.2047 5.5444 6.3332 8.0902 5.9608 6.1740 1.0705 1.0694 1.0697 1.0665 1.0665 1.0887 1.0910 1.0829 1.0643 1.0963 1.0979 1.0853 1.0847 1.1070 1.0884 1.0881 1.0941 1.0935 1.0939 1.0940 1.0984 1.0995 1.0953
irintensity: 0.0887 0.0260 0.1061 0.3310 0.0627 0.5211 0.9313 2.2270 0.3816 1.2058 0.9997 2.6062 5.1449 4.2089 1.2753 1.5570 3.6753 0.2972 10.5652 9.5173 1.9138 4.4847 1.5960 3.1786 0.1535 0.3059 7.6308 0.9992 2.4641 2.8237 2.2964 33.9565 5.4988 19.0287 6.1512 6.3102 14.8178 7.7509 4.5770 0.9005 29.8731 66.8487 20.9326 2.3697 13.2327 51.1343 37.3873 5.6144 21.0563 10.8889 10.7642 0.1784 2.2154 6.4189 17.5629 13.1545 0.8606 4.0205 2.6522 0.6984 0.3884 0.1558 9.9591 7.3087 7.9428 65.1589 5.1141 9.9075 9.9934 11.9365 18.1661 3.4192 34.1369 12.5615 8.9748 49.1396 1.6604 96.5988 72.9686 0.3843 0.0119 3.4391 10.9575 6.7084 5.5943 28.2927 18.5698 0.1440 4.9171 14.2379 3.7038 5.5455 25.0689 9.7010 16.0834 11.8337 3.4630 10.3288 0.7445 3.1756 4.1968 0.8361 8.0124 4.1200 13.2971 24.8796 11.7243 2.4594 0.7691 15.7567 8.4139 2.8315 53.8063 10.7776 12.5364 243.2248 4.8477 8.4643 72.8149 2.0431 1.7868 45.0120 73.0248 107.8549 33.5237 103.6551 41.8131 26.7033 6.9851 22.1366 38.4293 40.0310 4.0838 5.2293 3.1851 4.0966 3.8280 24.7112 36.3202 6.0731 16.2725 45.8780 17.1163 9.4538
temp: 298.150 k
press: 1.00000 atm
elementType: 8 8 7 7 7 6 6 6 6 6 6 6 6 6 6 6 6 6 6 6 6 6 6 6 6 6 6 1 1 1 1 1 1 1 1 1 1 1 1 1 1 1 1 1 1 1 1 1 1 1
symmnumber: 1
zpe: 1065459.5 jmol-1
zpe.correction: 0.405812 hartree
zpe.thermalcorrener: 0.429137 hartree
zpe.thermalcorrenthalpy: 0.430081 hartree
zpe.thermalcorrgfe: 0.348720 hartree
zpe.sumelectzpe: -1164.868851 hartree
zpe.sumelectthermal: -1164.845525 hartree
zpe.sumelectthermalent: -1164.844581 hartree
zpe.sumelectthermalfe: -1164.925943 hartree
dipole: -3.3204 1.6775 0.4942
dipole: 3.7528
quadrupole: -159.5463 -144.6347 -159.9208
quadrupole: 1.2335 -10.7546 -1.7928
quadrupole: -4.8457 10.0660 -5.2202 1.2335 -10.7546 -1.7928
hfenergy: -1165.2746627 hartree
pointgroup: C01 [X(C22H23N3O2)]
dipole: -1.2243552 0.7884474 0.2434731 debye
polarizability: 333.1530242|18.9666437|386.8434332|-46.4669606|8.0819328|159.3090499 unknown
InChI: InChI=1S/C22H23N3O2/c26-22-20(18-7-3-1-4-8-18)17-21(19-9-5-2-6-10-19)23-25(22)12-11-24-13-15-27-16-14-24/h1-10,17H,11-16H2
charge 0 multiplicity 1
50 atoms
O  7.023137 -0.900519 0.205296
O  0.069539 -2.405855 -0.617177
N  4.134096 -0.931017 -0.075353
N  0.468456 -0.107837 -0.639074
N  0.155209 1.2169 -0.480393
C  2.709364 -0.759484 0.27371
C  4.89549 0.344047 -0.097276
C  4.836208 -1.942634 0.755611
C  1.885701 -0.374244 -0.981576
C  6.320601 0.096055 -0.619725
C  6.258692 -2.160321 0.214356
C  -0.401161 -1.232834 -0.456898
C  -1.786384 -0.874171 -0.089643
C  -1.120697 1.514636 -0.141781
C  -2.099119 0.479021 0.039558
C  -2.806846 -1.931646 0.127857
C  -1.439999 2.961695 0.007024
C  -2.733423 -3.192812 -0.531138
C  -3.911587 -1.688742 0.99638
C  -2.608451 3.396323 0.690075
C  -0.564387 3.944496 -0.532433
C  -3.746252 -4.15788 -0.347696
C  -4.917246 -2.657439 1.182579
C  -2.896969 4.771758 0.822402
C  -0.852552 5.316928 -0.397882
C  -4.843095 -3.897614 0.504916
C  -2.022592 5.739306 0.277943
H  2.555825 0.01578 1.063752
H  2.31619 -1.716873 0.658627
H  4.952776 0.797032 0.924742
H  4.386866 1.06955 -0.75949
H  4.276266 -2.895129 0.710058
H  4.899853 -1.626506 1.827038
H  1.923653 -1.209059 -1.697894
H  2.273961 0.545181 -1.445299
H  6.273466 -0.255728 -1.673021
H  6.931871 1.011801 -0.55971
H  6.830873 -2.8477 0.859017
H  6.202547 -2.570541 -0.816994
H  -3.134492 0.76747 0.239608
H  -1.876318 -3.40975 -1.171887
H  -3.967149 -0.750303 1.560022
H  -3.290854 2.668814 1.14278
H  0.336811 3.610941 -1.055046
H  -3.673985 -5.118852 -0.868799
H  -5.750478 -2.452611 1.863899
H  -3.800598 5.087074 1.355646
H  -0.168742 6.059425 -0.824067
H  -5.62323 -4.653161 0.650158
H  -2.248146 6.806533 0.379392
