program: Gaussian 09
title: 000216822
version: EM64L-G09RevD.01
frameworkgroup: C1[X(C18H18Cl2N2O4)]
method: RPBEPBE
basis: SDD
operation: Freq
keyword: #p
keyword: freq=noraman
keyword: PBEPBE/SDD
title: #p freq=noraman PBEPBE/SDD
converged: YES YES NO NO
title: Mulliken charges:
elementType: Cl Cl O O O O N N C C C C C C C C C C C C C C C C C C H H H H H H H H H H H H H H H H H H
charge: -0.056016 -0.041331 -0.258086 -0.243170 -0.240384 -0.252009 0.002949 -0.024903 -0.354766 -0.384730 -0.509537 -0.480302 0.272644 0.274587 -0.471280 -0.474309 0.460926 0.462860 -0.244367 -0.228450 -0.456689 -0.441861 -0.060217 -0.072577 -0.326858 -0.319400 0.222782 0.204556 0.227873 0.227660 0.240823 0.240230 0.237639 0.223336 0.230883 0.244346 0.244022 0.230991 0.271646 0.305059 0.283587 0.262122 0.299932 0.269789
chargesum: 0.00000
title: Mulliken charges with hydrogens summed into heavy atoms:
elementType: Cl Cl O O O O N N C C C C C C C C C C C C C C C C C C
charge: -0.056016 -0.041331 -0.258086 -0.243170 -0.240384 -0.252009 0.002949 -0.024903 0.072572 0.070802 -0.028485 -0.019327 0.272644 0.274587 0.003950 0.000704 0.460926 0.462860 0.027279 0.076609 -0.173102 -0.179739 -0.060217 -0.072577 -0.026926 -0.049611
polarizability: 2.20117426e+02 -2.34020411e+01 2.17629928e+02 -9.74217089e+00 -1.80738377e+01 2.40198395e+02
1716.lowfreq: -9.7919 -0.0012 -0.0008 -0.0006 3.6025 6.4115 13.9395 16.7536 21.8619
frequency: 12.7076 16.7021 21.7945 27.7610 31.0914 44.2969 55.1285 65.4253 67.2134 69.4818 95.2991 123.6079 151.2754 162.7811 171.6471 178.5322 188.5376 193.9554 212.2069 255.1123 268.0904 284.1144 286.1905 308.8983 353.9640 363.9722 381.8911 391.0879 395.3073 415.4431 442.3920 453.9852 468.8332 504.7353 508.5214 559.5598 586.9386 618.9914 640.9293 645.4611 669.2092 675.0575 693.0194 717.4588 718.9538 746.7650 760.7852 791.2419 846.2149 856.4231 857.4625 872.1935 893.0716 900.0247 912.1138 917.2003 922.1800 930.2822 939.6134 942.7788 981.6840 983.0712 993.7266 1002.9937 1005.8332 1035.7049 1045.8283 1071.5232 1086.1102 1091.6825 1106.3372 1134.8945 1135.9498 1162.9938 1194.4432 1212.1841 1228.1341 1229.2303 1234.1745 1237.8847 1266.0457 1276.6497 1297.7247 1306.1357 1310.1264 1317.3432 1319.0688 1326.6120 1329.5827 1347.8559 1352.1643 1361.1725 1412.7682 1418.0645 1430.3469 1432.2656 1445.1502 1451.4897 1457.0129 1457.6791 1463.2493 1478.1321 1536.8628 1540.2039 1575.8571 1577.0575 1635.7123 1639.3988 2982.4374 2990.5688 3000.6617 3009.8646 3035.4179 3038.5719 3039.5940 3059.4204 3079.2292 3091.6186 3113.9297 3116.8846 3131.3656 3149.1399 3152.9525 3157.1414 3159.2498 3173.2881
redmass: 7.8985 7.3503 11.4572 8.5860 9.4341 5.8008 5.8375 7.3185 7.6662 8.9247 2.6480 4.2006 5.0479 6.8436 5.0693 6.7993 4.3362 4.0614 3.5813 4.8698 4.2625 3.9627 4.3520 3.6339 3.5227 2.9067 4.3420 4.0408 7.1348 3.0833 4.6215 4.6381 4.4635 4.9116 4.8182 5.0096 5.2635 4.8623 4.0782 3.9237 6.6455 6.3829 5.3513 2.4659 2.4638 1.4693 3.1631 3.5527 2.3805 2.8160 4.2781 2.4544 1.8022 1.8692 2.2930 3.5329 1.8983 1.3966 1.5938 1.5199 1.9681 1.9577 2.4117 5.1911 4.9464 3.1595 2.7899 2.0178 2.5103 2.5219 2.2797 2.2205 2.1834 2.6380 1.3752 1.8255 1.3895 1.4801 1.6575 1.4893 1.2755 1.3254 1.1054 7.3410 3.9787 1.4758 1.2977 1.3648 1.3190 1.2778 1.2990 1.4825 2.1263 2.1078 2.4139 2.5247 1.0808 1.0970 1.1099 1.1123 1.0730 1.0988 6.0497 6.2995 6.3310 6.2055 9.8147 10.1004 1.0608 1.0609 1.0632 1.0605 1.0988 1.0593 1.0583 1.1026 1.0980 1.1024 1.1079 1.1066 1.0921 1.0911 1.0954 1.0948 1.0937 1.0943
irintensity: 0.2117 0.1762 0.0884 0.0949 0.1831 1.6539 1.2051 0.3396 1.3852 2.2321 0.4150 0.5034 0.6023 3.0397 2.8356 2.3770 2.1102 0.2549 1.7645 2.1541 2.4700 3.2201 5.4115 7.1451 4.7596 7.2390 9.7032 6.8471 10.0929 10.0912 0.7058 0.3235 6.1250 2.6447 1.9254 2.4260 2.1651 3.4256 0.2954 2.9901 20.1286 38.3545 2.7954 36.4613 40.7048 6.6058 9.1064 14.0935 33.7968 52.2180 33.1842 3.7351 31.6456 59.2327 4.1415 80.4795 33.5923 2.4827 1.5050 4.0032 0.7995 10.7408 19.8453 6.8758 21.2464 9.2660 30.3881 103.6314 27.0330 31.9765 119.7728 0.9030 1.8670 55.1060 40.0468 165.8087 35.4296 37.0214 16.2515 22.0493 12.6611 16.2310 6.3931 0.5872 2.6410 1.1842 3.8090 10.5577 12.3824 10.1361 23.0983 3.1409 43.8774 40.9922 7.8949 5.6431 15.2627 7.6156 23.4378 16.1993 4.9298 14.3336 10.9173 14.2170 15.4579 4.4274 110.5711 169.9628 1.3017 30.2016 28.4573 26.4226 1.5279 31.2267 30.9029 16.5292 16.3146 30.1033 4.1729 3.6286 8.6174 2.6849 3.4437 2.8500 2.7061 1.8915
temp: 298.150 k
press: 1.00000 atm
elementType: 17 17 8 8 8 8 7 7 6 6 6 6 6 6 6 6 6 6 6 6 6 6 6 6 6 6 1 1 1 1 1 1 1 1 1 1 1 1 1 1 1 1 1 1
symmnumber: 1
zpe: 867312.7 jmol-1
zpe.correction: 0.330342 hartree
zpe.thermalcorrener: 0.355703 hartree
zpe.thermalcorrenthalpy: 0.356647 hartree
zpe.thermalcorrgfe: 0.269473 hartree
zpe.sumelectzpe: -2025.324503 hartree
zpe.sumelectthermal: -2025.299142 hartree
zpe.sumelectthermalent: -2025.298198 hartree
zpe.sumelectthermalfe: -2025.385372 hartree
dipole: 3.3423 -1.3355 -4.0540
dipole: 5.4212
quadrupole: -151.3885 -169.6700 -171.1648
quadrupole: -1.6696 1.3245 3.9320
quadrupole: 12.6859 -5.5956 -7.0904 -1.6696 1.3245 3.9320
hfenergy: -2025.6548446 hartree
pointgroup: C01 [X(C18H18Cl2N2O4)]
dipole: 1.2806059 -1.1750176 -1.236289 debye
polarizability: 231.2795185|-18.8566465|201.2993878|9.9032094|12.7348683|245.3668431 unknown
InChI: InChI=1S/C18H18Cl2N2O4/c19-15-5-13(7-21-9-15)11-25-17(23)3-1-2-4-18(24)26-12-14-6-16(20)10-22-8-14/h5-10H,1-4,11-12H2
charge 0 multiplicity 1
44 atoms
Cl -1.033035 1.363827 -3.742604
Cl -3.694058 0.241273 3.789375
O  3.816444 0.630797 -0.461696
O  -1.104542 -2.614012 -0.85094
O  3.653008 1.415814 1.729111
O  -0.884018 -3.425497 1.326844
N  -0.108267 3.016708 -0.121618
N  -3.605942 1.122852 -0.193559
C  3.392896 -2.04074 0.517856
C  1.869229 -1.984032 0.763923
C  4.176061 -0.967174 1.313444
C  1.124724 -3.066621 -0.065411
C  3.845458 0.468606 0.934295
C  -0.359531 -3.07687 0.243191
C  3.488195 2.012642 -0.957618
C  -2.594793 -2.535523 -0.650755
C  1.993694 2.201435 -1.08892
C  -2.997022 -1.243464 0.023791
C  1.29736 1.748131 -2.238056
C  -3.127365 -1.158767 1.433946
C  1.242441 2.829724 -0.061549
C  -3.254511 -0.077648 -0.740491
C  -0.094062 1.94052 -2.288815
C  -3.503142 0.077131 1.988823
C  -0.775764 2.574904 -1.22788
C  -3.729953 1.199573 1.162753
H  3.603719 -1.91687 -0.56033
H  3.775454 -3.037707 0.813878
H  1.482045 -0.983901 0.487497
H  1.650737 -2.133997 1.838457
H  3.993627 -1.061554 2.397926
H  5.262278 -1.110595 1.147798
H  1.277709 -2.895708 -1.143962
H  1.531439 -4.062142 0.195417
H  3.997031 2.054263 -1.933321
H  3.923633 2.747058 -0.258889
H  -2.912714 -3.414088 -0.063437
H  -2.98277 -2.593917 -1.679287
H  1.827687 1.256774 -3.060188
H  -2.916938 -2.029512 2.061605
H  1.739399 3.178989 0.849798
H  -3.1629 -0.094626 -1.833153
H  -1.862041 2.711909 -1.243726
H  -4.006402 2.170334 1.585775
