program: Gaussian 09
title: 000216758
version: EM64L-G09RevD.01
frameworkgroup: C1[X(C18H21N3O)]
method: RPBEPBE
basis: SDD
operation: Freq
keyword: #p
keyword: freq=noraman
keyword: PBEPBE/SDD
title: #p freq=noraman PBEPBE/SDD
converged: YES YES NO NO
title: Mulliken charges:
elementType: O N N N C C C C C C C C C C C C C C C C C C H H H H H H H H H H H H H H H H H H H H H
charge: -0.292073 -0.104799 -0.053410 0.047041 -0.327239 -0.338047 -0.524445 -0.396403 -0.412333 0.289113 0.326462 -0.758732 -0.367583 -0.420200 0.504645 -0.250394 -0.248782 -0.396340 -0.446422 -0.226996 -0.225394 -0.250693 0.238319 0.215983 0.196103 0.218045 0.222632 0.231358 0.240267 0.225289 0.235521 0.258605 0.237402 0.225237 0.266639 0.236918 0.227810 0.228529 0.247726 0.233711 0.227565 0.227708 0.231657
chargesum: 0.00000
title: Mulliken charges with hydrogens summed into heavy atoms:
elementType: O N N N C C C C C C C C C C C C C C C C C C
charge: -0.292073 -0.104799 -0.053410 0.047041 0.127063 0.076100 -0.070455 0.069153 0.081793 0.289113 0.326462 -0.296093 -0.100944 -0.183282 0.504645 -0.022584 -0.020253 -0.148614 -0.212711 0.000569 0.002314 -0.019037
polarizability: 2.30942752e+02 -3.11177918e+01 2.25086684e+02 -1.17308089e+01 1.15949587e+01 1.77000118e+02
1716.lowfreq: -15.5052 -0.0004 0.0004 0.0007 2.8996 5.7281 10.7742 29.1950 36.8535
frequency: -8.6135 28.6914 36.6902 42.8512 54.4652 64.0500 76.7627 142.0878 154.8440 183.1477 207.8896 230.8643 265.3862 287.8565 290.7448 305.2258 330.4290 342.9691 379.4041 401.8072 404.1961 436.0076 449.3602 468.2212 478.2516 499.1474 552.1050 589.5092 607.4319 615.0924 622.4540 656.7620 703.9420 729.0839 737.0666 754.7534 767.9215 786.1484 790.9160 813.2949 833.3730 843.4995 856.8470 886.7240 904.7226 935.6685 947.1020 952.8602 963.9473 979.1756 989.9475 992.8683 996.8968 1001.1669 1005.6486 1026.3686 1043.8053 1045.0494 1051.8212 1079.9519 1091.0745 1117.6783 1128.4822 1135.4174 1169.1604 1172.1469 1178.3737 1180.7766 1188.1147 1190.1768 1196.6133 1205.5335 1225.4504 1254.6464 1269.0993 1279.8475 1287.8387 1302.6040 1320.1886 1321.5797 1330.7213 1334.7284 1337.4909 1358.5709 1362.6738 1375.9289 1381.5982 1397.5669 1437.1635 1439.7387 1451.7832 1457.6584 1458.1450 1465.4420 1467.3200 1477.5797 1483.4467 1485.6879 1587.8702 1591.9507 1609.4904 1613.8135 2866.0864 2880.8113 2916.2156 2977.5642 2987.9240 2990.6607 2995.7606 3025.4088 3036.8311 3058.6739 3074.1302 3087.9823 3111.2243 3114.2184 3120.9638 3127.0501 3134.1834 3141.8614 3143.8962 3159.8268 3162.6536
redmass: 5.5670 3.9450 5.3706 3.9612 4.9940 4.3134 4.9559 4.2859 4.2231 3.7703 3.3720 4.0037 3.1563 2.9552 4.1997 2.1594 3.5937 4.0518 2.5755 2.2366 2.6284 3.1671 3.7661 3.6162 3.1739 3.5663 5.0141 3.7622 3.8024 5.5275 5.2337 2.9001 2.2212 2.1238 2.7488 1.4377 3.9469 2.9365 3.2987 3.0987 1.5419 3.8974 1.2470 1.3715 1.4723 2.0748 1.7915 2.9225 1.4589 1.3846 6.2345 1.4351 1.3166 2.6289 1.7849 2.2449 1.9502 1.8752 2.2694 1.6221 2.2488 2.2924 2.4575 3.4117 1.1045 1.0564 1.3925 1.6196 1.1172 1.0737 1.7532 2.2838 2.4069 2.0060 1.6278 1.4772 1.5403 1.4081 2.1033 1.4191 1.5263 1.3208 1.4005 1.6744 1.7436 2.8476 6.0173 1.9084 2.1491 2.1848 1.0803 1.0861 1.0874 1.1033 1.2322 1.2180 1.9364 1.9808 6.6286 6.0892 6.1680 6.2178 1.0705 1.0707 1.0646 1.0607 1.0924 1.0647 1.0620 1.0995 1.0891 1.0899 1.1000 1.0977 1.0877 1.0872 1.0860 1.0876 1.0909 1.0933 1.0959 1.1006 1.1013
irintensity: 0.2530 0.1343 2.5263 0.7955 0.6011 0.5361 1.2671 1.2783 3.4729 3.5723 0.9387 2.3444 2.7550 1.1247 1.8507 8.9507 3.0098 1.6421 0.8295 1.1797 0.4109 4.0427 4.5448 3.1494 0.8638 5.5297 3.3553 1.4066 9.7142 1.3318 4.6338 1.0082 32.0588 42.5862 26.0365 56.9508 9.6747 11.1251 23.8899 6.8450 0.4641 0.4003 0.5455 0.4212 1.7143 6.9278 12.7099 157.5997 9.6495 0.0922 0.6272 5.5121 0.5665 6.6721 13.6468 7.0849 3.1188 6.6595 6.4989 10.5065 57.9623 53.8500 14.7690 8.0186 2.0055 0.2713 0.3555 1.2444 1.2630 2.3815 2.9335 2.9791 2.0220 29.9138 48.0765 2.9371 20.5842 19.5373 121.9493 28.0405 0.6639 0.8866 1.0066 4.4704 33.5418 0.7577 0.1087 5.1596 8.0519 8.1425 10.2416 13.7781 11.6926 3.6438 28.2191 15.4286 21.8476 5.5399 0.0841 1.0738 7.6558 3.8834 56.6018 56.4536 65.2155 30.3462 25.5824 22.8005 27.4272 13.7415 40.1159 18.6725 6.9794 8.6955 9.1783 9.4698 1.3641 5.0336 7.6564 19.8398 35.0200 37.5196 21.3049
temp: 298.150 k
press: 1.00000 atm
elementType: 8 7 7 7 6 6 6 6 6 6 6 6 6 6 6 6 6 6 6 6 6 6 1 1 1 1 1 1 1 1 1 1 1 1 1 1 1 1 1 1 1 1 1
symmnumber: 1
zpe: 932252.1 jmol-1
zpe.correction: 0.355076 hartree
zpe.thermalcorrener: 0.373563 hartree
zpe.thermalcorrenthalpy: 0.374507 hartree
zpe.thermalcorrgfe: 0.307125 hartree
zpe.sumelectzpe: -936.314478 hartree
zpe.sumelectthermal: -936.295991 hartree
zpe.sumelectthermalent: -936.295046 hartree
zpe.sumelectthermalfe: -936.362429 hartree
dipole: 4.6976 -1.3733 0.9163
dipole: 4.9792
quadrupole: -162.8941 -125.4009 -121.0354
quadrupole: 8.1668 -5.3759 2.8842
quadrupole: -26.4506 11.0426 15.4080 8.1668 -5.3759 2.8842
hfenergy: -936.6695536 hartree
pointgroup: C01 [X(C18H21N3O1)]
dipole: 1.7958624 0.6775876 -0.3916119 debye
polarizability: 227.1752333|31.2835298|228.7572335|10.3730604|12.9228402|177.0970873 unknown
InChI: InChI=1S/C18H21N3O/c22-19-21-12-10-20(11-13-21)15-18-9-5-4-8-17(18)14-16-6-2-1-3-7-16/h1-9H,10-15H2
charge 0 multiplicity 1
43 atoms
O  -5.731346 -1.007845 0.140289
N  -1.352435 0.966092 -0.565848
N  -3.784792 0.047213 0.563295
N  -4.734274 -0.883703 0.948706
C  -1.320092 0.047709 0.602965
C  -2.502157 0.654792 -1.452446
C  -0.061437 0.985543 -1.304696
C  -2.609245 0.208349 1.43221
C  -3.832538 0.825261 -0.689501
C  1.060372 1.658171 -0.513123
C  2.396364 1.157959 -0.511039
C  2.790782 -0.133157 -1.229025
C  0.765153 2.85133 0.192996
C  3.392929 1.878627 0.197367
C  2.25402 -1.41629 -0.582703
C  1.765151 3.555723 0.896471
C  3.09152 3.067767 0.896364
C  2.246887 -1.576292 0.826894
C  1.78458 -2.485623 -1.387618
C  1.784621 -2.774776 1.415391
C  1.322358 -3.686862 -0.802947
C  1.319155 -3.835444 0.603108
H  -0.448384 0.302526 1.229865
H  -1.208878 -1.017906 0.282603
H  -2.44603 -0.388422 -1.854287
H  -2.489709 1.350484 -2.311662
H  -0.233565 1.561796 -2.236731
H  0.240223 -0.041544 -1.612682
H  -2.676172 -0.551891 2.228268
H  -2.624292 1.217258 1.888517
H  -3.991339 1.893076 -0.445759
H  -4.694279 0.454578 -1.272075
H  3.897297 -0.188719 -1.250544
H  2.470235 -0.107794 -2.288252
H  -0.2718 3.205726 0.187367
H  4.421831 1.497332 0.196867
H  1.514383 4.476744 1.43473
H  3.881238 3.605086 1.433281
H  2.598383 -0.755356 1.463019
H  1.784085 -2.378633 -2.48017
H  1.787532 -2.882239 2.506282
H  0.962899 -4.501955 -1.441343
H  0.958367 -4.763993 1.059297
