program: Gaussian 09
title: 000216805
version: EM64L-G09RevD.01
frameworkgroup: C1[X(C20H22N3O5)]
method: RPBEPBE
basis: SDD
operation: Freq
keyword: #p
keyword: freq=noraman
keyword: PBEPBE/SDD
title: #p freq=noraman PBEPBE/SDD
converged: YES YES NO NO
title: Mulliken charges:
elementType: O O O O O N N N C C C C C C C C C C C C C C C C C C C C H H H H H H H H H H H H H H H H H H H H H H
charge: -0.127289 -0.402480 -0.300441 -0.267136 -0.182183 -0.031908 -0.431072 0.081853 -0.371391 -0.548144 0.450860 -0.294185 0.394530 0.113299 -0.404539 -0.386244 0.207861 0.164874 0.122303 -0.340187 0.276359 -0.351004 -0.223412 -0.233499 -0.233080 -0.478344 -0.515657 -0.529219 0.277733 0.266065 0.252053 0.265282 0.346166 0.249455 0.244338 0.415373 0.286233 0.265259 0.248679 0.247983 0.250857 0.286060 0.235273 0.219725 0.243943 0.214887 0.279124 0.262117 0.238899 0.243969
chargesum: 1.00000
title: Mulliken charges with hydrogens summed into heavy atoms:
elementType: O O O O O N N N C C C C C C C C C C C C C C C C C C C C
charge: -0.127289 -0.402480 -0.300441 -0.267136 -0.182183 -0.031908 -0.015699 0.081853 0.172406 -0.030809 0.450860 0.051981 0.394530 0.113299 -0.155085 -0.141906 0.207861 0.164874 0.122303 -0.053953 0.276359 -0.085746 0.025267 0.014484 0.017777 0.262714 0.222297 0.215766
polarizability: 4.19374493e+02 -4.00137017e+01 2.81594330e+02 -4.26462128e+01 -2.00695610e+01 1.68429907e+02
1716.lowfreq: -8.7667 -3.2610 -0.0003 0.0004 0.0008 3.4933 9.9576 15.5148 25.8498
frequency: 9.2282 15.1697 25.8006 33.0401 47.4860 48.7077 56.1199 75.5351 83.2301 89.9288 105.5760 125.2613 128.3498 138.9302 148.2901 176.6938 178.4489 189.4121 219.1760 225.0784 237.7336 252.2481 267.8509 297.2777 310.3715 323.9715 332.4576 348.6230 358.3320 379.2202 401.4474 402.7977 422.5872 427.8711 477.8224 488.4993 525.6047 552.4286 553.3463 588.0306 597.9360 616.1262 627.6658 658.3810 667.9775 671.8845 706.8766 707.4044 729.4178 753.3655 759.5286 764.7653 768.7064 780.8931 824.1096 825.9495 843.6346 860.8766 879.4894 901.3695 916.5195 942.9823 952.6700 956.0092 958.7529 974.3588 984.2776 986.7534 989.9587 1006.2806 1008.5354 1022.5176 1027.2990 1039.2709 1072.9364 1088.7509 1107.6317 1107.9790 1110.3354 1111.4575 1145.9952 1150.4566 1157.2536 1164.7832 1179.5275 1191.5781 1193.1264 1201.1662 1204.0040 1214.3268 1234.9890 1255.5390 1273.2691 1310.7747 1337.1833 1342.8007 1372.7432 1377.9922 1382.2123 1400.5492 1405.7172 1427.8436 1431.2240 1440.7466 1441.8905 1449.1972 1452.8330 1463.2389 1466.8386 1468.2471 1471.0805 1476.2833 1479.7955 1483.9758 1484.9892 1497.6865 1550.4908 1591.6505 1599.9140 1609.9786 1611.3516 1661.1592 2928.9352 2987.4541 2988.3289 3002.8765 3006.1770 3044.0338 3068.7571 3089.3647 3107.5893 3114.1701 3115.7811 3116.9196 3125.6560 3144.7322 3148.0649 3148.6180 3156.4498 3160.7977 3163.9610 3173.6531 3184.3960 3267.0653
redmass: 4.8835 5.5103 5.0264 3.8667 3.6045 6.3457 4.3999 4.9066 4.4660 1.7293 3.3044 3.7518 3.6758 3.2040 1.9131 2.7617 2.0698 3.4060 1.6516 2.1739 4.4735 4.2640 3.3955 4.7351 4.5405 5.3269 3.3233 3.8045 4.6382 5.0868 2.8417 5.5687 4.2643 4.3185 6.5440 4.0230 6.2092 4.5967 3.6042 6.7445 5.9579 6.2710 4.3534 5.6197 5.1755 2.6608 3.0511 2.7454 6.0925 3.1406 1.8020 1.6750 5.8718 6.9121 7.1351 1.5689 6.5295 1.2530 8.0436 1.7540 6.4768 1.7324 3.3482 2.5986 1.5554 1.3468 1.5603 4.4292 5.3120 2.4240 1.3439 4.5440 2.2731 3.9916 3.5729 1.8206 1.2670 1.6009 1.2568 1.5744 1.3809 1.4069 1.4346 1.4483 1.0598 1.9668 1.3815 1.5392 1.5131 2.2335 2.2605 3.2072 3.7491 1.4411 1.3001 1.5183 3.1601 4.0593 6.1460 2.3419 2.0100 1.2352 1.3588 1.2791 2.0411 1.1349 1.1034 1.1314 1.1506 1.1770 1.0563 1.1028 1.3101 1.5834 2.2493 1.6918 6.7823 5.9202 6.8938 6.1038 6.8223 5.1757 1.0880 1.0324 1.0348 1.0623 1.0315 1.0617 1.0988 1.1057 1.0964 1.0896 1.1047 1.1067 1.0892 1.0895 1.1030 1.1046 1.0952 1.1043 1.0889 1.1013 1.0961 1.1024
irintensity: 0.8115 0.3265 1.3499 0.6633 4.5433 0.8354 0.3887 3.0245 1.9188 2.2505 2.5786 6.3404 14.6295 3.5836 2.2702 1.3702 1.7559 6.2794 2.1167 4.5957 2.5235 0.9191 0.3036 6.1873 4.9098 0.4886 0.9605 6.2381 10.0126 3.3514 0.0427 1.8163 5.6036 2.9205 0.0196 14.1978 46.4298 3.2228 12.7412 15.1878 0.8073 0.1319 0.9057 11.6654 7.6656 16.8147 30.7527 25.1729 33.7243 30.8009 18.1206 38.9682 6.1000 29.4043 21.9478 46.9124 2.9901 0.0720 26.0265 7.4536 83.3631 17.8990 33.3373 14.5586 55.2716 0.3141 15.1007 183.2961 19.1256 1.4261 0.6303 3.0456 3.2534 21.8925 350.6125 40.3085 8.3791 10.8408 0.1064 16.7474 14.2622 6.3319 6.9759 10.8113 0.5710 13.3816 0.2978 11.1495 23.8768 14.4763 55.5058 374.3999 541.5052 1.2007 2.1065 6.0310 18.3709 11.2192 0.3564 190.0146 30.7401 0.5680 72.7894 41.7441 9.1455 11.1687 40.0160 12.9285 104.2511 39.5164 18.7145 31.1593 42.0972 7.4299 10.3599 85.7489 30.2111 3.1770 770.4752 23.3025 186.7235 787.0269 854.7135 51.1688 61.3378 10.3922 42.1608 2.6159 5.8317 24.5339 28.3831 8.0790 22.6403 0.9832 5.7197 1.8306 10.5681 5.5709 16.0651 5.4715 1.5184 9.0105 5.6006 29.7988
temp: 298.150 k
press: 1.00000 atm
elementType: 8 8 8 8 8 7 7 7 6 6 6 6 6 6 6 6 6 6 6 6 6 6 6 6 6 6 6 6 1 1 1 1 1 1 1 1 1 1 1 1 1 1 1 1 1 1 1 1 1 1
symmnumber: 1
zpe: 1026873.3 jmol-1
zpe.correction: 0.391115 hartree
zpe.thermalcorrener: 0.418166 hartree
zpe.thermalcorrenthalpy: 0.419110 hartree
zpe.thermalcorrgfe: 0.329756 hartree
zpe.sumelectzpe: -1313.319739 hartree
zpe.sumelectthermal: -1313.292689 hartree
zpe.sumelectthermalent: -1313.291745 hartree
zpe.sumelectthermalfe: -1313.381099 hartree
dipole: 1.9385 2.9291 -3.5095
dipole: 4.9653
quadrupole: -26.6254 -153.3673 -147.0228
quadrupole: -5.1798 -11.8892 -7.4840
quadrupole: 82.3798 -44.3621 -38.0177 -5.1798 -11.8892 -7.4840
hfenergy: -1313.7108549 hartree
pointgroup: C01 [X(C20H22N3O5)]
dipole: -0.5397472 0.9357515 -1.627624 debye
polarizability: 404.6519032|-84.4562073|186.9864408|-9.0892929|21.157452|277.7603848 unknown
InChI: InChI=1S/C20H22N3O5/c1-25-16-10-9-15(18(26-2)19(16)27-3)20(24)21-17-13-23(22-28-17)12-11-14-7-5-4-6-8-14/h4-10,13,21H,11-12H2,1-3H3
charge 1 multiplicity 1
50 atoms
O  -1.848528 1.340416 2.635785
O  1.477896 0.008528 -0.774157
O  3.9287 -1.122593 -1.585089
O  5.933355 -1.611104 0.307693
O  0.681788 0.67493 3.305166
N  -3.554637 1.537462 1.256863
N  -0.138191 0.59745 1.102744
N  -3.2528 1.705987 2.571657
C  -4.965909 1.78443 0.841149
C  -5.725206 0.464586 0.532687
C  -5.140915 -0.324883 -0.631062
C  -2.510634 1.105994 0.475404
C  -1.407404 0.978081 1.345264
C  2.205184 -0.036665 1.545278
C  -4.530575 -1.586246 -0.41336
C  -5.184406 0.197024 -1.951766
C  2.510235 -0.255565 0.158835
C  0.910716 0.437848 2.092239
C  3.767224 -0.775385 -0.241743
C  3.215835 -0.30646 2.505011
C  4.751753 -1.052376 0.765802
C  4.473188 -0.792342 2.131878
C  -3.972276 -2.31291 -1.491442
C  -4.623514 -0.524473 -3.029221
C  -4.012751 -1.781438 -2.800695
C  1.775699 0.551191 -2.126626
C  5.148992 -0.675704 -2.308365
C  6.963008 -1.999276 1.293018
H  -5.438938 2.32963 1.674151
H  -4.931376 2.441059 -0.043917
H  -5.763564 -0.151388 1.448767
H  -6.765182 0.773072 0.311724
H  -2.610352 0.903892 -0.585331
H  -4.508661 -2.013106 0.596873
H  -5.684716 1.154535 -2.148319
H  0.194236 0.380401 0.120052
H  2.974783 -0.125365 3.556744
H  5.223392 -0.994946 2.899563
H  -3.519535 -3.293571 -1.310979
H  -4.680425 -0.119766 -4.045319
H  -3.591402 -2.347732 -3.637816
H  2.107655 -0.260895 -2.785282
H  2.547144 1.337596 -2.059296
H  0.822704 0.983267 -2.471597
H  4.980048 -0.984137 -3.350464
H  5.251838 0.424224 -2.245697
H  6.042663 -1.166365 -1.897577
H  7.770703 -2.439651 0.692769
H  7.337381 -1.115115 1.839625
H  6.563578 -2.750545 1.997476
