program: Gaussian 09
title: 000211538
version: EM64L-G09RevD.01
frameworkgroup: C1[X(C24H27N3O4)]
method: RPBEPBE
basis: SDD
operation: Freq
keyword: #p
keyword: freq=noraman
keyword: PBEPBE/SDD
title: #p freq=noraman PBEPBE/SDD
converged: YES YES NO NO
title: Mulliken charges:
elementType: O O O O N N N C C C C C C C C C C C C C C C C C C C C C C C C H H H H H H H H H H H H H H H H H H H H H H H H H H H
charge: -0.248236 -0.299152 -0.259981 -0.259765 -0.094754 -0.207737 -0.044423 -0.351084 -0.338347 -0.351009 -0.362723 -0.319049 -0.313800 0.140196 0.176527 0.006135 -0.363359 0.346196 0.363899 -0.364494 -0.372236 -0.352242 -0.384440 -0.374260 -0.377212 0.322043 -0.361045 -0.378641 0.317549 -0.536932 -0.536960 0.201727 0.249390 0.197198 0.206422 0.218884 0.191118 0.235478 0.251767 0.213348 0.193067 0.193634 0.212770 0.228416 0.295459 0.228618 0.270641 0.218444 0.241889 0.250494 0.251508 0.240455 0.224014 0.246361 0.226190 0.247463 0.222169 0.222410
chargesum: 0.00000
title: Mulliken charges with hydrogens summed into heavy atoms:
elementType: O O O O N N N C C C C C C C C C C C C C C C C C C C C C C C C
charge: -0.248236 -0.299152 -0.259981 -0.259765 -0.094754 -0.207737 -0.044423 0.100033 0.065272 0.058993 0.124523 0.087367 0.092604 0.140196 0.176527 0.006135 -0.134943 0.346196 0.363899 -0.069036 -0.143617 -0.081601 -0.165996 -0.132371 -0.126718 0.322043 -0.109536 -0.138186 0.317549 0.159631 0.155082
polarizability: 4.09829512e+02 5.06344130e+01 4.80742103e+02 -2.30060338e+01 -2.78426621e+00 1.66757599e+02
1716.lowfreq: -9.1227 -3.6653 -0.0007 -0.0005 0.0006 3.2806 10.2456 16.8488 20.4617
frequency: 7.9716 16.7972 20.3371 23.5991 28.2713 40.2458 52.4642 63.7851 70.8257 86.6109 93.6562 111.1297 124.7323 130.3017 171.2626 187.4278 190.4537 209.1788 214.3480 231.6065 234.6481 243.3418 254.4541 272.9712 285.8933 315.6600 322.4632 347.6278 358.3445 370.7393 389.6174 399.8664 405.8139 412.8655 414.1748 439.2464 458.3676 467.7453 474.4588 493.0440 518.0618 540.3431 544.7296 560.7072 583.1165 615.3862 626.8069 631.6730 645.6379 647.3660 716.9749 729.0839 740.6138 758.9690 762.2594 775.1921 776.8172 793.1543 806.5510 808.0112 816.1904 835.7705 839.5028 845.3155 849.3021 894.2360 899.7404 912.4926 934.7263 954.3680 964.7471 983.9270 984.9317 985.8349 995.6911 998.3998 1000.4669 1008.8199 1026.0551 1041.8295 1052.8895 1070.5240 1076.9266 1093.1669 1106.9775 1111.4845 1112.3675 1116.3024 1120.8631 1133.1746 1139.8058 1155.8909 1159.2038 1181.7476 1188.0909 1189.6785 1194.6401 1235.1612 1237.7786 1241.3737 1245.1650 1258.2420 1270.6244 1289.7362 1295.6274 1304.7528 1312.4604 1315.7191 1318.2418 1329.6814 1335.3755 1346.3822 1352.1055 1360.8376 1368.7104 1370.0078 1385.1615 1388.4003 1419.0243 1428.9627 1435.6892 1437.0492 1437.6947 1442.5363 1446.9591 1449.7110 1458.0442 1466.0862 1466.9980 1467.4566 1472.0868 1472.6605 1483.2688 1498.6131 1511.1177 1556.0187 1565.9566 1576.1569 1592.5932 1619.5871 1623.9112 2864.6287 2870.6999 2893.1979 2955.0863 2959.7864 2960.7091 2964.7659 3031.1304 3035.2036 3049.2473 3049.5554 3054.7555 3056.0017 3079.9504 3083.6968 3127.4015 3127.4603 3129.0338 3134.7419 3135.6050 3155.2481 3156.1535 3160.7406 3164.1872 3168.0908 3176.0968 3186.6448
redmass: 4.5903 3.4476 4.9938 3.9491 3.4953 5.2756 4.3636 5.2061 3.8762 4.6739 4.5063 4.6173 4.1714 4.7203 3.6818 4.0019 4.0167 3.0926 1.6160 1.6571 1.5463 2.0825 4.1296 4.3385 4.0091 2.3934 3.9150 4.1549 5.4084 3.3385 2.8484 3.6422 5.0668 3.0697 3.1035 5.7553 4.2962 2.7974 4.6007 4.0291 2.7695 3.7616 4.4325 5.2499 2.9214 4.1315 4.0834 5.8503 4.7464 5.0949 5.5294 4.2704 3.7807 4.5369 5.4265 4.6243 2.6754 1.8974 3.5383 1.3817 1.2613 1.7626 1.5989 4.3390 1.7156 2.4841 1.6417 5.0990 1.3986 1.3837 1.3589 1.4586 7.8164 6.5652 2.8339 2.8015 2.9409 2.2816 2.2218 4.0085 2.0054 3.8989 2.9276 2.6845 2.2714 1.2660 1.2603 1.4357 1.4015 2.4377 2.5246 1.3272 1.3295 1.3338 1.3367 1.0847 1.9899 3.1301 5.0704 2.1797 1.7140 2.1491 1.3041 1.3547 1.3664 1.3453 1.3078 1.3241 1.4330 1.8371 1.3968 1.3722 3.8951 1.4383 4.3629 1.2855 1.3936 4.0061 4.2205 3.8368 1.2532 1.2068 1.1952 1.0827 1.0860 1.0971 1.0980 2.5460 1.0503 1.0498 1.2787 1.0841 1.0969 2.5172 2.8416 5.7411 6.5782 7.3757 8.0561 6.2120 6.3046 1.0704 1.0693 1.0696 1.0662 1.0663 1.0330 1.0327 1.0885 1.0911 1.1040 1.0739 1.1041 1.0734 1.0965 1.0981 1.0993 1.1070 1.0999 1.0886 1.0879 1.0879 1.0894 1.0922 1.0928 1.0953 1.0971 1.0949
irintensity: 0.0577 0.5727 0.0643 0.1801 1.3692 0.3715 0.0048 1.7863 0.7143 0.6876 4.8566 4.8663 5.6698 1.3888 3.7911 1.4980 2.5931 2.2806 3.1239 3.8293 2.8269 3.6197 1.4048 1.1009 2.4765 10.7308 11.1914 5.6523 1.9586 2.4372 4.8891 8.5369 0.4216 0.3534 0.5900 4.1155 1.1622 0.8973 0.0122 9.5910 7.8234 36.9189 68.8387 18.5901 2.6600 16.8803 10.1326 4.7642 2.1175 5.7158 4.5983 3.8975 1.7468 1.0707 5.4194 3.4539 2.3902 4.6673 31.5503 15.2384 7.8109 84.1852 1.9005 50.1559 44.2406 10.2236 4.6440 17.1740 0.4392 4.5892 4.4922 20.4439 41.8638 74.8454 8.8395 55.4119 7.0879 25.4406 10.5117 13.0561 15.1942 7.6059 45.6776 40.7146 6.9262 0.4979 0.2001 19.0423 17.5345 124.7524 68.9262 6.2119 2.9662 223.1123 178.5490 8.8577 8.9371 119.8832 176.5355 138.3223 18.3083 4.3540 4.7538 15.0542 6.1798 1.6515 4.2484 15.6815 28.1234 35.9409 5.1456 6.7949 42.9640 2.6682 2.0350 4.2773 2.5619 6.7087 40.2497 21.3510 23.3073 15.7483 2.4421 2.8131 1.2319 16.9886 7.6481 7.6866 13.9541 13.9990 80.3039 72.4092 10.3511 321.7027 59.6096 285.9157 35.4347 11.0755 63.4718 211.0386 98.6280 45.3859 91.3740 94.4777 35.5701 105.6954 79.2142 87.4800 40.2122 27.4492 46.6909 10.1266 44.1510 22.9863 38.6585 41.9271 31.2818 5.4774 28.1815 0.4571 22.1776 3.8218 12.4815 1.4970 18.9727 13.0191 5.7411 13.6039
temp: 298.150 k
press: 1.00000 atm
elementType: 8 8 8 8 7 7 7 6 6 6 6 6 6 6 6 6 6 6 6 6 6 6 6 6 6 6 6 6 6 6 6 1 1 1 1 1 1 1 1 1 1 1 1 1 1 1 1 1 1 1 1 1 1 1 1 1 1 1
symmnumber: 1
zpe: 1229841.4 jmol-1
zpe.correction: 0.468422 hartree
zpe.thermalcorrener: 0.497246 hartree
zpe.thermalcorrenthalpy: 0.498190 hartree
zpe.thermalcorrgfe: 0.403939 hartree
zpe.sumelectzpe: -1393.575295 hartree
zpe.sumelectthermal: -1393.546471 hartree
zpe.sumelectthermalent: -1393.545526 hartree
zpe.sumelectthermalfe: -1393.639777 hartree
dipole: -4.3221 1.7366 1.6944
dipole: 4.9566
quadrupole: -185.0235 -146.5498 -184.5739
quadrupole: 5.3510 -10.6213 -0.4932
quadrupole: -12.9744 25.4993 -12.5248 5.3510 -10.6213 -0.4932
hfenergy: -1394.0437166 hartree
pointgroup: C01 [X(C24H27N3O4)]
dipole: -1.651066 0.8233936 0.6314557 debye
polarizability: 414.9516086|52.1652783|473.0470919|-30.2883699|-24.2345581|169.3305129 unknown
InChI: InChI=1S/C24H27N3O4/c1-29-20-7-3-18(4-8-20)22-17-23(19-5-9-21(30-2)10-6-19)25-27(24(22)28)12-11-26-13-15-31-16-14-26/h3-10,17H,11-16H2,1-2H3
charge 0 multiplicity 1
58 atoms
O  7.006469 -2.977946 0.65613
O  -0.06327 -2.632127 -0.264102
O  -6.565103 -3.184996 0.543095
O  0.323504 7.20454 -0.273768
N  4.230459 -2.222232 0.27874
N  0.924042 -0.542161 -0.55234
N  0.983128 0.829808 -0.534382
C  2.911571 -1.610072 0.539563
C  5.324276 -1.231641 0.115784
C  4.615011 -3.265653 1.262946
C  2.223774 -1.211853 -0.790625
C  6.616935 -1.94385 -0.317373
C  5.911895 -3.953072 0.805294
C  -0.216265 -1.365135 -0.29632
C  -1.47832 -0.616733 -0.111466
C  -0.174253 1.4904 -0.29167
C  -1.40354 0.7780 -0.088229
C  -2.76654 -1.331243 0.046872
C  -0.089258 2.974484 -0.266284
C  -2.83928 -2.674535 0.512907
C  -3.999986 -0.673033 -0.255442
C  1.06109 3.63494 -0.790163
C  -1.12285 3.778087 0.27846
C  -4.076708 -3.324673 0.698359
C  -5.23553 -1.309576 -0.081812
C  -5.282672 -2.642438 0.404991
C  1.166882 5.03204 -0.777099
C  -1.031808 5.187002 0.299326
C  0.118025 5.819385 -0.233491
C  -6.670094 -4.569905 1.014288
C  -0.730521 8.06367 0.272548
H  2.983309 -0.71067 1.198102
H  2.267187 -2.350022 1.045949
H  5.512402 -0.677021 1.069782
H  5.04138 -0.490429 -0.654907
H  3.804274 -4.015029 1.326417
H  4.773402 -2.835423 2.283804
H  2.842826 -0.503221 -1.362141
H  2.044406 -2.124163 -1.379674
H  7.465835 -1.241175 -0.35575
H  6.467144 -2.407407 -1.316353
H  5.73425 -4.46684 -0.164029
H  6.265703 -4.680662 1.55439
H  -2.315027 1.353894 0.090024
H  -1.910375 -3.210285 0.71836
H  -3.994097 0.341032 -0.669947
H  1.867596 3.025603 -1.207434
H  -2.012417 3.315872 0.719479
H  -4.084241 -4.355899 1.063703
H  -6.175667 -0.807848 -0.329806
H  2.046027 5.540919 -1.183729
H  -1.8490 5.76985 0.734437
H  -6.244559 -4.680961 2.030244
H  -7.748478 -4.783683 1.037286
H  -6.164069 -5.268237 0.320343
H  -0.366454 9.091304 0.128858
H  -1.68437 7.925466 -0.272679
H  -0.887251 7.87055 1.351634
