program: Gaussian 09
title: 000211537
version: EM64L-G09RevD.01
frameworkgroup: C1[X(C23H24ClN3O3)]
method: RPBEPBE
basis: SDD
operation: Freq
keyword: #p
keyword: freq=noraman
keyword: PBEPBE/SDD
title: #p freq=noraman PBEPBE/SDD
converged: YES YES NO NO
title: Mulliken charges:
elementType: Cl O O O N N N C C C C C C C C C C C C C C C C C C C C C C C H H H H H H H H H H H H H H H H H H H H H H H H
charge: -0.052693 -0.247680 -0.290215 -0.260467 -0.094986 -0.205546 -0.042910 -0.350338 -0.337339 -0.351633 -0.363400 -0.318267 -0.313312 0.135632 0.177258 0.020181 -0.362672 0.354346 0.359664 -0.352311 -0.381139 -0.354782 -0.375762 -0.378849 -0.360199 -0.227534 -0.228108 0.323040 -0.109817 -0.536710 0.200829 0.251132 0.204251 0.197908 0.192393 0.220442 0.253676 0.236432 0.213323 0.193119 0.194019 0.214335 0.235495 0.296836 0.234054 0.217044 0.267518 0.252737 0.242390 0.257351 0.255510 0.223773 0.223834 0.248144
chargesum: 0.00000
title: Mulliken charges with hydrogens summed into heavy atoms:
elementType: Cl O O O N N N C C C C C C C C C C C C C C C C C C C C C C C
charge: -0.052693 -0.247680 -0.290215 -0.260467 -0.094986 -0.205546 -0.042910 0.101623 0.064820 0.061202 0.126708 0.088175 0.095043 0.135632 0.177258 0.020181 -0.127177 0.354346 0.359664 -0.055475 -0.147085 -0.137737 -0.108245 -0.126111 -0.117808 0.029817 0.027402 0.323040 -0.109817 0.159042
polarizability: 4.26700253e+02 6.41586671e+01 4.27658784e+02 -2.67703585e+01 2.41212074e+01 1.64898015e+02
1716.lowfreq: -7.6513 -3.3714 -0.0005 0.0006 0.0009 2.4721 10.3846 16.8843 20.6767
frequency: 9.2017 16.8083 20.6121 22.2381 36.5604 43.6382 55.0912 60.8671 68.3891 85.9833 96.6301 114.5239 136.4393 161.1970 182.1841 189.3514 216.1379 228.3162 237.3605 243.5373 254.6759 264.4823 279.6810 315.8992 317.9440 346.2750 359.7174 369.7458 389.2001 396.8345 403.8835 407.7703 411.7568 435.2016 452.4329 466.4379 470.2124 485.7928 515.3558 536.3569 548.3660 581.8249 615.0903 624.7405 628.9855 638.2434 644.9433 674.8169 710.6397 736.8781 737.8306 756.6323 771.1857 776.5596 792.8748 806.6849 817.4425 820.8653 832.5083 837.1088 842.1245 844.3048 894.6731 903.8435 913.5809 950.6052 953.0256 966.4111 971.0236 985.0556 995.5835 997.4230 998.7466 1007.9785 1026.7454 1039.0613 1053.1374 1066.2995 1075.7076 1080.3446 1092.8319 1106.4559 1112.2444 1116.6182 1118.7065 1132.8697 1140.7937 1158.6596 1180.9987 1190.1699 1193.6122 1199.0714 1236.0042 1237.9087 1243.7998 1257.3662 1271.1179 1287.0601 1296.5439 1303.4929 1304.8354 1316.3903 1317.6734 1328.8427 1335.1528 1347.3160 1351.5544 1362.8607 1367.2132 1370.1481 1385.4767 1387.7416 1401.2907 1418.7863 1436.6475 1438.5252 1444.0913 1450.1263 1451.7385 1460.6229 1465.7378 1468.6633 1473.5494 1479.5405 1481.7013 1509.4078 1556.2281 1569.4110 1576.8879 1595.3096 1600.5110 1623.6437 2865.1032 2871.9586 2890.2390 2955.0698 2959.7368 2963.6600 3031.3868 3036.7202 3049.8537 3053.2031 3056.6998 3080.0301 3083.9925 3129.0372 3129.6487 3138.7499 3139.9616 3152.2302 3159.5192 3165.3659 3169.9051 3171.0969 3174.0434 3191.0281
redmass: 6.0110 3.8185 3.5369 4.7596 4.2370 6.9302 4.6202 6.0703 4.4922 5.4416 4.8717 4.4518 5.8214 5.2647 5.2692 4.5314 2.3014 3.4175 2.1524 1.9477 3.0749 6.5015 4.4967 2.4301 4.2476 4.2518 4.7194 3.3825 3.9275 3.2781 3.9451 2.9586 2.9449 6.9539 6.2586 3.3292 3.4439 4.8867 2.8278 3.7498 5.1633 2.9721 4.6125 3.5391 5.2099 5.7404 5.0969 7.3025 4.0570 4.5807 4.1003 4.8845 3.9990 2.6620 1.9488 3.5116 1.2698 1.3055 1.8196 1.7372 1.6349 3.7950 2.5509 1.8974 3.3699 1.3737 1.3740 1.3745 1.3665 8.3923 3.0645 4.2270 2.7925 2.3296 2.2410 4.0041 2.0326 5.2165 2.7963 2.3956 2.6681 2.3483 1.2594 1.4016 1.4453 2.4629 2.5116 1.3352 1.2737 1.1999 1.5974 1.2114 4.5114 3.0574 1.4811 2.3994 1.3015 1.3664 1.3636 1.2775 1.3451 1.4569 1.3483 1.8840 1.3155 1.4422 3.4490 1.4842 4.0869 1.2666 3.9082 1.4387 3.4221 4.3676 1.2566 1.1940 1.0826 1.0889 1.0969 1.0974 2.9568 1.0499 1.2119 2.4270 1.0959 2.7966 6.0711 6.9792 7.3035 6.5624 7.4778 6.4069 1.0705 1.0695 1.0697 1.0663 1.0663 1.0328 1.0885 1.0910 1.0810 1.1041 1.0663 1.0964 1.0980 1.0997 1.1071 1.0890 1.0882 1.0874 1.0900 1.0907 1.0953 1.0959 1.0963 1.0957
irintensity: 0.2044 0.9001 0.0534 0.0255 0.0578 0.0915 0.1485 0.2061 0.5748 6.0271 1.3539 4.0602 1.5056 1.0436 1.9880 2.1063 3.0041 9.0760 1.3230 1.2152 1.9784 0.8491 0.7550 8.1710 10.2164 1.7425 0.8783 1.8983 17.4537 7.9016 2.2134 0.2767 0.0246 16.7066 14.9888 2.7397 2.9806 9.3190 5.0080 59.9397 31.4948 2.9808 12.7673 5.5096 0.7395 4.2563 3.2712 8.2319 3.3654 3.5361 2.2435 1.5166 7.6747 5.6583 6.2683 29.7503 1.6024 11.4942 105.0627 33.6491 4.3776 43.5377 5.0476 13.6055 12.5178 0.9494 0.1900 5.7244 2.1366 71.3569 26.2633 27.2044 47.9891 40.7265 11.6382 15.9545 17.4986 17.2639 56.9084 21.3170 41.6208 6.7191 0.1615 9.1061 30.7416 114.0631 75.5010 1.8173 165.0169 1.2967 6.4789 4.9236 22.5272 232.8841 8.7405 6.3787 5.1327 16.8768 5.0305 3.8301 0.9520 39.0839 7.1039 22.3722 3.1578 9.1355 26.3490 4.1642 11.6418 4.0221 58.9279 9.5436 8.7598 1.3574 17.1635 17.6985 2.8186 2.5903 16.0048 8.1795 46.6496 14.1460 57.6420 159.4286 11.9436 152.4520 231.9507 9.1703 28.1640 65.2236 24.2954 137.6303 45.4294 80.9408 102.8321 36.1884 100.0900 82.6656 42.2504 26.0685 7.2850 45.5489 24.3277 38.0997 40.9278 27.4197 2.4864 1.9870 20.1274 8.2695 7.7599 2.3188 12.1140 5.2354 6.1411 7.7906
temp: 298.150 k
press: 1.00000 atm
elementType: 17 8 8 8 7 7 7 6 6 6 6 6 6 6 6 6 6 6 6 6 6 6 6 6 6 6 6 6 6 6 1 1 1 1 1 1 1 1 1 1 1 1 1 1 1 1 1 1 1 1 1 1 1 1
symmnumber: 1
zpe: 1122078.1 jmol-1
zpe.correction: 0.427377 hartree
zpe.thermalcorrener: 0.454781 hartree
zpe.thermalcorrenthalpy: 0.455726 hartree
zpe.thermalcorrgfe: 0.364425 hartree
zpe.sumelectzpe: -1738.612017 hartree
zpe.sumelectthermal: -1738.584612 hartree
zpe.sumelectthermalent: -1738.583668 hartree
zpe.sumelectthermalfe: -1738.674969 hartree
dipole: 2.0964 4.8514 -0.2219
dipole: 5.2896
quadrupole: -198.1792 -170.3243 -183.5726
quadrupole: 14.5398 -8.6982 -0.3706
quadrupole: -14.1538 13.7011 0.4528 14.5398 -8.6982 -0.3706
hfenergy: -1739.0393936 hartree
pointgroup: C01 [X(C23H24Cl1N3O3)]
dipole: 0.1819677 2.0689549 -0.1316106 debye
polarizability: 384.9458652|51.2145365|466.0084756|-44.5569105|6.9505528|168.3027112 unknown
InChI: InChI=1S/C23H24ClN3O3/c1-29-20-8-4-18(5-9-20)22-16-21(17-2-6-19(24)7-3-17)23(28)27(25-22)11-10-26-12-14-30-15-13-26/h2-9,16H,10-15H2,1H3
charge 0 multiplicity 1
54 atoms
Cl -6.458018 -4.713727 0.661789
O  7.146553 -2.145809 0.209573
O  0.046019 -2.806039 -0.583722
O  -1.198882 6.930735 0.323239
N  4.273923 -1.815323 -0.032743
N  0.735034 -0.578558 -0.642582
N  0.594384 0.778693 -0.50408
C  2.885141 -1.448598 0.308031
C  5.191769 -0.651743 -0.123872
C  4.853568 -2.869368 0.838291
C  2.109175 -1.028195 -0.96641
C  6.56262 -1.105342 -0.652681
C  6.226151 -3.294169 0.290898
C  -0.271467 -1.577667 -0.454703
C  -1.605694 -1.037381 -0.121677
C  -0.637784 1.246281 -0.191719
C  -1.744626 0.346468 -0.017378
C  -2.755644 -1.953588 0.086728
C  -0.771118 2.720939 -0.066162
C  -2.810733 -3.240213 -0.523791
C  -3.857187 -1.550675 0.897277
C  -1.912777 3.324764 0.534587
C  0.25762 3.576405 -0.541438
C  -2.024189 4.719803 0.648526
C  0.161926 4.977166 -0.433823
C  -3.93385 -4.077098 -0.357869
C  -4.982048 -2.378888 1.077006
C  -0.987797 5.556171 0.163245
C  -5.0073 -3.634073 0.436902
C  -0.15301 7.840903 -0.154257
H  2.834275 -0.620515 1.056445
H  2.378285 -2.328452 0.742321
H  4.768154 0.10309 -0.812532
H  5.326583 -0.16457 0.874986
H  4.976311 -2.515143 1.892467
H  4.174962 -3.74252 0.845141
H  2.044629 -1.89506 -1.641175
H  2.604163 -0.185585 -1.473108
H  7.287929 -0.274802 -0.643977
H  6.450062 -1.494883 -1.687535
H  6.098401 -3.742458 -0.717927
H  6.71729 -4.018257 0.961667
H  -2.737181 0.769354 0.159359
H  -1.961921 -3.586758 -1.116363
H  -3.828707 -0.592776 1.427689
H  -2.72263 2.70867 0.939239
H  1.140406 3.123333 -1.001836
H  -2.898462 5.184541 1.113753
H  0.974618 5.60106 -0.817367
H  -3.967435 -5.059633 -0.836999
H  -5.815019 -2.062063 1.710929
H  -0.000279 7.739196 -1.246092
H  0.803957 7.665474 0.374114
H  -0.524955 8.849676 0.076118
