program: Gaussian 09
title: 000211536
version: EM64L-G09RevD.01
frameworkgroup: C1[X(C22H21Cl2N3O2)]
method: RPBEPBE
basis: SDD
operation: Freq
keyword: #p
keyword: freq=noraman
keyword: PBEPBE/SDD
title: #p freq=noraman PBEPBE/SDD
converged: YES YES NO NO
title: Mulliken charges:
elementType: Cl Cl O O N N N C C C C C C C C C C C C C C C C C C C C C C H H H H H H H H H H H H H H H H H H H H H
charge: -0.047552 -0.049310 -0.246766 -0.286166 -0.097939 -0.205936 -0.033664 -0.344920 -0.352653 -0.342235 -0.378153 -0.310904 -0.317863 0.131638 0.183696 0.022159 -0.358205 0.355198 0.368318 -0.350254 -0.379004 -0.366582 -0.358449 -0.225599 -0.226432 -0.227480 -0.218636 -0.110760 -0.111667 0.221697 0.225396 0.211727 0.194453 0.201110 0.222013 0.252914 0.247394 0.191361 0.214208 0.216392 0.192212 0.236879 0.295704 0.233410 0.222578 0.275879 0.258612 0.256757 0.257422 0.258000
chargesum: 0.00000
title: Mulliken charges with hydrogens summed into heavy atoms:
elementType: Cl Cl O O N N N C C C C C C C C C C C C C C C C C C C C C C
charge: -0.047552 -0.049310 -0.246766 -0.286166 -0.097939 -0.205936 -0.033664 0.102172 0.053528 0.080888 0.122155 0.094665 0.090741 0.131638 0.183696 0.022159 -0.121326 0.355198 0.368318 -0.054549 -0.145594 -0.144004 -0.082570 0.033013 0.030325 0.029942 0.039364 -0.110760 -0.111667
polarizability: 3.60379163e+02 -1.53070425e+01 4.67288800e+02 3.83163557e+01 -1.44789410e-01 1.57885751e+02
1716.lowfreq: -5.8633 -2.4370 0.0006 0.0017 0.0018 2.1217 7.1559 20.1064 22.7297
frequency: 6.0926 20.0959 22.7008 28.5463 35.6809 42.7678 52.2871 59.4398 77.1739 82.8053 103.5559 134.3288 153.2176 182.9512 198.3237 205.2057 236.1387 245.6231 253.0597 258.2622 287.3451 311.6052 316.3486 348.9501 357.7899 364.9624 390.8199 399.1338 405.1248 406.8921 408.3754 434.4962 446.7357 461.0911 469.5988 484.2490 497.4126 537.8766 576.0187 612.9814 622.1681 626.4379 630.4982 643.7046 656.5991 701.2642 712.6010 721.8138 753.5399 758.6714 765.3176 792.5273 809.6535 820.4994 822.8025 832.5061 841.7072 843.2063 845.5323 892.5411 902.8827 912.3362 949.8867 951.1695 967.5864 980.8853 995.0919 997.4040 998.0469 1004.2376 1026.8714 1038.5276 1053.1037 1063.0618 1075.2187 1076.8240 1080.4495 1092.1036 1106.1428 1113.7882 1118.9172 1132.6388 1138.7059 1186.7065 1189.6304 1192.8770 1199.3449 1235.5457 1242.4727 1255.4293 1271.7437 1288.7224 1296.3618 1297.7480 1303.6991 1309.1409 1320.9314 1329.3612 1333.9610 1347.1638 1350.2175 1361.4242 1367.3511 1371.0798 1383.6901 1387.8570 1396.0915 1402.1085 1432.8329 1444.9141 1450.2918 1452.0292 1461.1255 1466.6908 1476.9021 1478.9418 1489.6860 1557.7537 1568.7543 1578.9192 1595.0240 1599.8699 1603.4670 2872.1260 2880.1250 2907.7980 2954.2551 2958.6613 3029.3926 3037.6445 3045.1369 3058.3058 3080.9105 3084.7677 3133.7503 3138.8637 3144.1306 3159.8290 3160.3278 3166.7995 3171.5357 3173.3410 3179.7631 3192.1943
redmass: 7.1166 5.5504 3.8141 3.7497 4.2909 9.3323 5.0548 7.7824 6.0790 5.0914 6.5304 6.2477 7.2588 6.6313 8.3237 4.2931 4.5491 2.4861 5.9123 4.4307 5.9560 4.5999 2.6905 3.4688 4.1755 4.3202 2.8097 4.7578 2.9423 2.9077 3.2718 7.3281 8.7547 6.2937 2.8381 4.5108 3.2807 3.7391 3.1359 4.6529 3.2770 5.0887 6.0121 5.3952 8.4162 5.9452 4.4123 3.3609 3.2681 4.9447 3.4877 1.9866 2.8971 1.3219 1.3574 1.9725 1.7219 2.2248 1.7623 2.5275 2.0790 2.9351 1.3699 1.3688 1.3744 1.3763 3.5639 4.3882 2.8300 2.5874 2.2703 4.0689 1.9992 6.4147 2.9911 2.5864 2.3159 2.7019 2.2431 1.4688 1.4203 2.5554 2.4495 1.4107 1.1174 1.5073 1.1746 2.6308 1.7574 2.4503 1.2848 1.4431 1.3042 1.3146 1.2798 1.2997 1.6093 1.7469 1.2998 1.9596 2.0998 2.2862 2.0355 1.2935 4.4935 1.4102 4.3489 3.4523 1.2051 1.0827 1.0818 1.0990 1.1011 4.6705 2.4111 1.1094 2.8141 6.1866 7.0292 7.7481 6.7477 6.7062 6.8486 1.0700 1.0697 1.0685 1.0665 1.0666 1.0907 1.0913 1.0898 1.0581 1.0963 1.0978 1.1069 1.0889 1.0889 1.0899 1.0886 1.0907 1.0959 1.0959 1.0973 1.0957
irintensity: 0.0561 0.0178 0.2059 0.0174 0.2212 0.0606 0.3626 0.5668 2.3666 1.3318 0.4226 1.9239 0.5900 1.7070 2.2041 3.8125 3.3261 1.2778 0.5092 2.9051 0.8198 6.5643 7.7371 8.2108 1.2479 4.8928 4.2104 8.3940 3.4322 0.6121 5.9282 30.0997 30.4624 11.5335 1.3585 6.8843 10.4120 46.9595 0.2129 9.6990 7.1010 3.6757 3.4592 2.8814 3.4809 12.9104 3.9058 0.5003 2.9952 2.5463 10.1865 12.2916 22.3651 10.2024 25.3055 82.3579 6.3904 30.1110 52.2796 2.3938 18.0332 9.7078 0.7194 0.6366 4.5036 4.7159 103.1137 23.2959 37.0860 16.9571 11.1339 25.1717 18.1685 16.9509 70.7198 34.1398 28.4462 29.8598 1.0021 7.6887 15.1790 41.9056 101.9141 12.9232 5.4008 11.8372 4.4908 10.5374 43.0640 0.2500 3.9834 28.9264 3.5078 0.8145 4.1559 22.7208 7.5056 20.5247 7.5457 3.6094 16.3269 5.5336 5.3830 6.6282 16.3753 5.9663 8.3875 12.3452 24.1378 2.8266 1.1917 15.3898 11.5982 2.5188 208.1747 11.9212 50.8058 229.8701 13.3541 9.6524 71.9573 28.6190 64.7195 56.4853 80.5589 65.4637 32.2366 107.6321 24.8039 26.2744 31.5098 18.6247 40.3203 35.8588 2.5628 6.2447 12.5093 7.2789 1.7117 2.1378 3.0297 7.2514 1.8573 7.2664
temp: 298.150 k
press: 1.00000 atm
elementType: 17 17 8 8 7 7 7 6 6 6 6 6 6 6 6 6 6 6 6 6 6 6 6 6 6 6 6 6 6 1 1 1 1 1 1 1 1 1 1 1 1 1 1 1 1 1 1 1 1 1
symmnumber: 1
zpe: 1014391.7 jmol-1
zpe.correction: 0.386361 hartree
zpe.thermalcorrener: 0.412331 hartree
zpe.thermalcorrenthalpy: 0.413275 hartree
zpe.thermalcorrgfe: 0.324663 hartree
zpe.sumelectzpe: -2083.649503 hartree
zpe.sumelectthermal: -2083.623534 hartree
zpe.sumelectthermalent: -2083.622590 hartree
zpe.sumelectthermalfe: -2083.711201 hartree
dipole: 1.6327 -1.5362 0.1700
dipole: 2.2483
quadrupole: -200.8453 -201.1569 -182.2431
quadrupole: 8.9194 8.7008 -1.4743
quadrupole: -6.0969 -6.4084 12.5053 8.9194 8.7008 -1.4743
hfenergy: -2084.0358647 hartree
pointgroup: C01 [X(C22H21Cl2N3O2)]
dipole: -0.2880298 0.8359186 0.0261955 debye
polarizability: 365.6687405|32.5003437|457.9332283|-48.7773557|-4.9482491|161.9517445 unknown
InChI: InChI=1S/C22H21Cl2N3O2/c23-18-5-1-16(2-6-18)20-15-21(17-3-7-19(24)8-4-17)25-27(22(20)28)10-9-26-11-13-29-14-12-26/h1-8,15H,9-14H2
charge 0 multiplicity 1
50 atoms
Cl -6.049361 -4.647316 1.055654
Cl -1.587234 7.702942 -0.223692
O  6.826034 -2.742373 0.292699
O  0.279301 -2.37166 -0.450544
N  4.373961 -1.216198 0.023852
N  0.812538 -0.108352 -0.644367
N  0.574751 1.238153 -0.594516
C  3.047812 -0.653762 0.349792
C  5.468189 -0.756966 0.917075
C  4.36989 -2.700968 -0.067403
C  2.215013 -0.481363 -0.946247
C  6.815674 -1.272957 0.382806
C  5.73078 -3.194128 -0.583562
C  -0.12171 -1.164121 -0.38366
C  -1.486819 -0.699585 -0.0609
C  -0.684524 1.63448 -0.296975
C  -1.722667 0.675396 -0.044342
C  -2.564797 -1.678418 0.2274
C  -0.917043 3.103966 -0.27055
C  -2.53777 -3.002764 -0.298679
C  -3.679801 -1.300944 1.032143
C  -2.075956 3.665222 0.330647
C  0.037291 3.986158 -0.849561
C  -3.595654 -3.903236 -0.056387
C  -4.739632 -2.192136 1.287363
C  -2.286058 5.060523 0.349153
C  -0.157171 5.380628 -0.837769
C  -4.685296 -3.485743 0.730347
C  -1.322428 5.900967 -0.238638
H  3.17984 0.338266 0.81992
H  2.48168 -1.29438 1.066052
H  5.480332 0.349187 0.935925
H  5.329876 -1.121863 1.96552
H  4.165409 -3.162252 0.930822
H  3.569529 -3.029375 -0.755125
H  2.192719 -1.429703 -1.504678
H  2.64564 0.315403 -1.569855
H  7.005487 -0.834326 -0.620811
H  7.641568 -1.013361 1.065599
H  5.7848 -4.295207 -0.577025
H  5.896446 -2.815966 -1.615395
H  -2.740878 1.038255 0.119442
H  -1.677146 -3.327407 -0.88648
H  -3.711347 -0.311058 1.500034
H  -2.823713 3.02653 0.811706
H  0.933779 3.561902 -1.309873
H  -3.566864 -4.914954 -0.47061
H  -5.583285 -1.893502 1.915933
H  -3.179033 5.483795 0.817454
H  0.57905 6.051071 -1.290095
