program: Gaussian 09
title: 000211534
version: EM64L-G09RevD.01
frameworkgroup: C1[X(C23H25N3O3)]
method: RPBEPBE
basis: SDD
operation: Freq
keyword: #p
keyword: freq=noraman
keyword: PBEPBE/SDD
title: #p freq=noraman PBEPBE/SDD
converged: YES YES NO NO
title: Mulliken charges:
elementType: O O O N N N C C C C C C C C C C C C C C C C C C C C C C C H H H H H H H H H H H H H H H H H H H H H H H H H
charge: -0.247697 -0.297592 -0.259175 -0.096334 -0.208242 -0.036222 -0.346541 -0.350270 -0.337382 -0.379101 -0.313468 -0.319873 0.133281 0.180945 0.013441 -0.366255 0.347322 0.349737 -0.370184 -0.362047 -0.381486 -0.369668 -0.376696 -0.373700 0.323120 -0.247909 -0.232535 -0.239259 -0.536844 0.224116 0.221377 0.192234 0.212476 0.218931 0.197987 0.251012 0.245442 0.191397 0.212973 0.214783 0.192354 0.231761 0.229393 0.295142 0.222249 0.268337 0.251525 0.242478 0.227587 0.228287 0.231004 0.226299 0.246939 0.224550
chargesum: 0.00000
title: Mulliken charges with hydrogens summed into heavy atoms:
elementType: O O O N N N C C C C C C C C C C C C C C C C C C C C C C C
charge: -0.247697 -0.297592 -0.259175 -0.096334 -0.208242 -0.036222 0.098952 0.054440 0.079536 0.117353 0.090902 0.087264 0.133281 0.180945 0.013441 -0.134494 0.347322 0.349737 -0.140791 -0.066905 -0.159237 -0.101330 -0.125172 -0.131222 0.323120 -0.020321 -0.004248 -0.008255 0.160945
chargesum: 0.00035
polarizability: 3.93405643e+02 5.73765849e+01 4.19589561e+02 -2.17847628e+01 4.54272942e+00 1.58246282e+02
1716.lowfreq: -6.6787 -4.9031 -1.3452 -0.4132 -0.0051 3.7403 11.8470 15.7693 22.9773
frequency: 11.1660 14.7490 22.9275 27.4770 32.5520 47.3384 55.0403 74.3545 81.1548 97.2614 106.5457 135.0532 138.3310 191.6162 192.3017 207.2416 229.8033 236.9761 238.8701 261.5696 283.5316 300.1567 316.5603 338.2032 355.4728 360.5241 385.8066 401.2662 401.8286 405.1150 414.1058 444.1625 468.4902 470.2696 489.5892 499.4414 542.1184 553.3577 570.3918 609.1691 614.9779 617.2433 632.3192 647.7733 657.3149 697.9303 729.0800 740.2299 759.4545 765.9776 769.1110 778.8523 794.6001 811.7132 815.7643 835.7223 838.4699 844.7846 851.0257 894.0035 900.4654 912.7904 928.1976 954.5497 964.9174 980.6323 984.3871 989.0696 997.0470 999.8626 1000.6947 1004.3647 1026.0834 1027.4301 1042.9714 1052.9205 1072.0711 1077.4650 1085.8291 1093.9126 1109.8554 1112.4326 1121.1227 1135.7334 1137.0673 1159.1758 1173.5518 1187.5957 1188.5239 1192.1761 1194.5509 1238.1776 1241.2076 1245.4928 1259.1049 1270.6471 1288.1708 1294.9255 1311.9601 1312.7602 1317.5341 1324.4179 1331.5751 1334.4734 1348.9994 1353.9812 1366.3099 1370.2496 1381.1339 1387.0155 1391.1781 1420.7281 1429.5368 1436.8599 1438.1921 1442.1943 1448.2875 1450.6089 1459.0078 1467.5958 1471.8297 1473.0822 1480.2724 1488.1704 1505.0896 1556.4203 1565.5797 1584.9463 1593.2058 1614.2198 1619.6816 2866.7461 2874.9309 2903.6768 2952.8784 2957.3001 2965.6398 3028.4708 3038.2308 3044.3482 3055.9208 3055.9887 3080.4808 3084.0001 3125.9194 3129.7867 3130.6610 3133.6021 3135.5496 3146.4196 3156.6801 3159.9489 3163.1089 3169.0073 3171.5428 3187.5161
redmass: 2.9951 5.4225 5.7739 3.8444 3.5314 4.7738 4.6375 6.6882 4.5431 4.0338 4.8727 4.2364 4.4724 3.8682 3.4741 2.8744 2.8925 1.4645 2.1510 5.7039 4.9116 3.7540 2.6316 3.8139 3.7028 5.1848 2.8020 2.7725 3.0498 4.9971 3.0930 5.5719 3.3092 3.5157 3.9229 3.8515 3.1815 6.2633 3.5474 3.7278 4.3181 4.8132 5.4030 4.4475 5.3949 1.7468 4.0920 4.9726 5.0140 4.5007 2.8745 1.9851 2.0893 2.7406 1.2627 1.7626 1.6220 5.0449 1.3163 2.5161 1.6189 4.7705 1.4602 1.3811 1.3590 1.4120 8.1674 5.7183 2.5723 1.7514 2.0778 2.4199 2.4552 2.2266 3.7006 1.9776 3.4925 2.7452 1.7123 2.5978 2.4749 1.2601 1.3944 2.6083 2.5778 1.3292 1.0550 1.3591 1.2985 1.3767 1.2889 3.9970 1.9289 2.0387 2.2430 1.2989 1.4157 1.3072 1.2662 1.3067 1.4319 1.7438 1.4425 1.4105 1.3732 4.4098 1.3677 1.3140 5.4894 4.1222 1.4080 2.3718 3.7595 1.1899 1.2640 1.0824 1.0837 1.0986 1.0985 1.0498 1.5481 1.8990 1.1066 2.4425 2.6855 5.6683 6.6285 6.9155 7.2626 6.0869 6.2069 1.0702 1.0696 1.0687 1.0665 1.0665 1.0326 1.0905 1.0909 1.0892 1.0600 1.1025 1.0961 1.0978 1.0848 1.0999 1.1070 1.0882 1.0883 1.0935 1.0894 1.0960 1.0908 1.0954 1.0993 1.0949
irintensity: 0.0839 0.0547 0.0594 0.3940 1.1801 0.7978 0.8815 1.0714 1.1980 0.2474 2.4403 7.1290 2.5747 2.2761 2.0802 0.5968 7.9421 0.0379 1.5831 1.5470 1.7589 0.2186 15.2337 4.8983 5.7927 2.5088 6.9406 0.6321 0.4385 10.5496 0.4466 1.9212 0.7926 0.5680 7.9027 6.6559 24.5519 54.8262 4.0674 5.4980 15.2720 8.5481 6.9217 8.2192 1.7633 48.5862 0.5925 10.4156 1.8123 2.7457 7.9695 52.0377 5.9399 17.6176 7.8634 80.2078 0.5420 35.4572 4.5621 6.2799 8.9784 25.8634 4.0715 3.2643 3.9830 3.1347 53.4897 0.4014 55.3581 4.7600 5.0685 21.3638 14.8245 7.6564 20.8817 15.6833 24.3027 21.9553 10.9153 18.4327 3.2128 0.2029 11.1348 31.1779 106.0407 2.9352 1.4384 186.5445 65.8870 10.8012 3.7103 47.9472 182.8528 25.6003 0.2690 5.0266 28.2320 2.4398 9.1808 11.9235 3.9865 18.5231 12.8663 19.4547 6.4317 15.3050 1.8013 8.4229 0.9778 3.5595 7.6256 6.2455 24.8136 14.4049 22.5906 1.9832 0.0710 17.1067 9.5231 14.1551 46.5453 28.9852 10.9687 109.7573 105.3029 281.5428 37.3199 30.0932 68.5254 3.7162 201.0777 53.0288 82.0373 71.6437 33.3572 108.7861 85.7215 26.9683 23.5129 30.1535 13.0092 52.9193 41.5235 36.0342 5.3548 27.9351 2.8487 4.3534 8.2907 31.9747 12.2291 17.4506 16.1136 10.7475 17.5227 12.5206
temp: 298.150 k
press: 1.00000 atm
elementType: 8 8 8 7 7 7 6 6 6 6 6 6 6 6 6 6 6 6 6 6 6 6 6 6 6 6 6 6 6 1 1 1 1 1 1 1 1 1 1 1 1 1 1 1 1 1 1 1 1 1 1 1 1 1
symmnumber: 1
zpe: 1148109.2 jmol-1
zpe.correction: 0.437292 hartree
zpe.thermalcorrener: 0.463328 hartree
zpe.thermalcorrenthalpy: 0.464272 hartree
zpe.thermalcorrgfe: 0.376627 hartree
zpe.sumelectzpe: -1279.223137 hartree
zpe.sumelectthermal: -1279.197101 hartree
zpe.sumelectthermalent: -1279.196157 hartree
zpe.sumelectthermalfe: -1279.283802 hartree
dipole: -2.7287 1.2213 1.0133
dipole: 3.1566
quadrupole: -168.3612 -149.4669 -172.7196
quadrupole: 21.7144 -7.0703 -0.3493
quadrupole: -4.8453 14.0490 -9.2037 21.7144 -7.0703 -0.3493
hfenergy: -1279.6604285 hartree
pointgroup: C01 [X(C23H25N3O3)]
dipole: -1.0339212 0.603722 0.3299735 debye
polarizability: 399.4897582|53.8189639|407.8101896|-35.2351793|-34.5384717|163.9415381 unknown
InChI: InChI=1S/C23H25N3O3/c1-28-20-9-7-18(8-10-20)21-17-22(19-5-3-2-4-6-19)24-26(23(21)27)12-11-25-13-15-29-16-14-25/h2-10,17H,11-16H2,1H3
charge 0 multiplicity 1
54 atoms
O  6.444195 -3.399682 0.837851
O  -0.016011 -2.002089 -0.222278
O  -6.501152 -2.489772 0.749971
N  4.282468 -1.545955 0.26952
N  0.969576 0.068121 -0.639834
N  1.029867 1.437102 -0.698086
C  3.044378 -0.765371 0.478786
C  5.378276 -1.185512 1.205526
C  4.053008 -3.015528 0.287771
C  2.268794 -0.611322 -0.852329
C  6.659211 -1.943073 0.817452
C  5.349985 -3.751055 -0.084328
C  -0.167927 -0.738772 -0.318534
C  -1.425975 0.021239 -0.153237
C  -0.122284 2.110659 -0.473745
C  -1.348854 1.415512 -0.20968
C  -2.711244 -0.679991 0.06929
C  -0.033554 3.596668 -0.530565
C  -3.949412 -0.036621 -0.246089
C  -2.776478 -1.994001 0.613793
C  -1.035381 4.423286 0.046856
C  1.077193 4.219539 -1.164488
C  -5.182018 -0.658667 -0.011532
C  -4.010871 -2.628576 0.861584
C  -5.221368 -1.960805 0.553444
C  -0.934196 5.830007 -0.015949
C  1.17751 5.623544 -1.225233
C  0.170576 6.438138 -0.653796
C  -6.600037 -3.84155 1.311144
H  3.313941 0.243329 0.842977
H  2.37464 -1.232149 1.239503
H  5.117231 -1.433148 2.265188
H  5.562688 -0.096454 1.142563
H  3.259461 -3.277596 -0.43527
H  3.713518 -3.355332 1.298381
H  2.055068 -1.600623 -1.285334
H  2.85335 -0.003785 -1.558811
H  6.981609 -1.626458 -0.198219
H  7.469395 -1.754326 1.541233
H  5.228988 -4.843195 0.005925
H  5.639809 -3.490024 -1.125071
H  -2.255143 2.004909 -0.049883
H  -3.950285 0.952166 -0.717705
H  -1.84489 -2.519496 0.832999
H  -1.888919 3.979301 0.570646
H  1.851635 3.584359 -1.604402
H  -6.126159 -0.169451 -0.268884
H  -4.013231 -3.636625 1.286679
H  -1.714393 6.449821 0.439668
H  2.038401 6.084853 -1.721901
H  0.247407 7.52986 -0.703306
H  -6.114053 -4.585332 0.651003
H  -7.678366 -4.04727 1.3738
H  -6.149973 -3.889306 2.321328
