program: Gaussian 09
title: 000211531
version: EM64L-G09RevD.01
frameworkgroup: C1[X(C22H22ClN3O2)]
method: RPBEPBE
basis: SDD
operation: Freq
keyword: #p
keyword: freq=noraman
keyword: PBEPBE/SDD
title: #p freq=noraman PBEPBE/SDD
converged: YES YES NO NO
title: Mulliken charges:
elementType: Cl O O N N N C C C C C C C C C C C C C C C C C C C C C C H H H H H H H H H H H H H H H H H H H H H H
charge: -0.060960 -0.247584 -0.272002 -0.095251 -0.203279 -0.035066 -0.348667 -0.340001 -0.352682 -0.364293 -0.318067 -0.313709 0.121321 0.173323 0.023485 -0.348588 0.450635 0.345877 -0.335392 -0.341622 -0.379444 -0.373907 -0.237728 -0.245441 -0.245910 -0.230356 -0.224049 -0.237100 0.202082 0.252115 0.198860 0.205823 0.220304 0.193085 0.253145 0.238046 0.192571 0.214028 0.214360 0.193351 0.265937 0.274361 0.232970 0.263475 0.257562 0.236486 0.229318 0.228727 0.238143 0.231711
chargesum: 0.00000
title: Mulliken charges with hydrogens summed into heavy atoms:
elementType: Cl O O N N N C C C C C C C C C C C C C C C C C C C C C C
charge: -0.060960 -0.247584 -0.272002 -0.095251 -0.203279 -0.035066 0.105530 0.064683 0.060706 0.126898 0.088531 0.094003 0.121321 0.173323 0.023485 -0.082652 0.450635 0.345877 -0.335392 -0.067261 -0.146474 -0.110433 0.019833 -0.008955 -0.016591 -0.001629 0.014094 -0.005389
polarizability: 3.30925430e+02 1.40104720e+01 3.83929119e+02 -3.38529776e+01 2.11007713e+01 1.79087122e+02
1716.lowfreq: -14.4479 -7.9987 -6.3303 -0.0014 0.0011 0.0013 6.2391 17.1327 19.8241
frequency: -10.9561 17.0476 19.6204 31.3891 32.9733 54.1816 55.0324 74.7067 81.0666 104.9783 118.6446 136.6000 170.4646 195.1322 223.7822 234.4264 239.4164 257.2701 261.7102 292.7002 315.7911 323.9859 348.5569 364.4912 380.4760 388.9663 401.9827 406.1782 414.8004 441.2430 459.1229 468.1286 489.5421 492.0481 548.5773 568.3678 596.5589 613.0715 618.6604 622.7199 643.7259 651.9357 682.7933 698.3027 716.8015 748.0540 755.1685 770.5540 774.2643 779.7842 792.2416 807.7657 840.0609 845.4235 851.8017 863.8426 894.1259 910.7986 918.5908 929.8047 948.5002 980.2471 986.3536 988.8020 996.0346 999.1878 1001.2098 1011.3510 1025.8841 1026.7870 1037.5328 1041.4541 1053.2493 1073.1020 1083.3319 1088.4293 1093.9797 1106.9805 1124.3617 1134.9545 1139.6171 1173.8514 1177.1863 1188.3435 1192.4787 1194.9908 1235.1011 1242.2713 1247.7647 1270.0939 1279.3756 1288.7864 1295.2243 1312.8811 1316.8854 1320.9140 1327.3877 1334.7512 1346.3620 1360.4606 1362.2737 1369.3300 1377.6548 1382.6185 1389.2051 1421.3188 1422.9746 1439.3510 1442.6678 1449.4323 1449.9646 1459.8641 1466.4535 1473.2639 1482.8513 1492.8299 1560.6853 1563.2376 1586.8841 1602.5233 1606.5058 1614.7001 2866.6260 2873.1138 2891.3635 2953.9590 2958.8314 3030.0614 3037.2988 3051.0477 3056.9226 3080.4042 3084.2249 3126.1819 3129.7943 3133.5666 3141.0887 3146.2207 3158.3801 3159.0883 3170.1986 3174.3536 3177.0772 3185.7395
redmass: 3.8176 3.9699 7.7645 4.0163 6.5384 5.1203 4.6902 5.0328 7.6705 4.5450 4.9338 7.1598 5.0066 3.7591 5.3565 2.7279 3.1243 4.5195 4.9018 4.1299 2.7062 4.6909 4.6526 3.4734 5.5143 2.6720 2.8346 3.4619 8.1984 3.8015 5.6680 2.8018 4.5790 3.9178 4.3168 3.7490 5.4464 4.5005 3.4422 4.9781 5.0322 5.6482 6.3932 1.7583 4.0512 1.8331 3.6439 3.1751 2.6337 2.1101 1.5439 3.3826 1.5965 4.1803 1.3193 1.5317 2.4876 4.2678 1.5649 1.4967 1.3988 1.4116 1.3460 5.5348 2.6341 1.5931 2.1774 6.3156 2.5246 2.2858 2.8595 3.2519 2.0085 2.5452 2.2579 2.0512 2.4948 2.4649 1.9478 2.2110 2.4725 1.0557 1.0744 1.1571 1.5466 1.2996 3.9488 1.5214 1.9592 1.3069 1.7037 1.4063 1.3478 1.3792 1.4596 1.4417 1.8492 1.2735 1.3044 5.2860 1.4228 1.2665 3.2103 5.7933 1.3828 2.4677 2.2853 1.2332 1.0823 1.0807 1.0989 1.0982 2.5859 4.2520 1.0975 2.6285 7.0659 5.8276 6.1982 6.7704 7.7469 6.3087 1.0704 1.0694 1.0698 1.0665 1.0664 1.0890 1.0910 1.0816 1.0660 1.0963 1.0980 1.0851 1.1074 1.0882 1.0864 1.0934 1.0919 1.0961 1.1002 1.0965 1.0921 1.0974
irintensity: 0.0775 0.0230 0.1266 0.0061 0.8396 0.7476 0.5726 1.2466 1.7191 1.2573 0.2608 1.6301 1.6709 5.4826 2.5469 2.7871 0.8590 6.0216 1.3586 0.8195 9.8772 8.1597 3.9254 3.4859 5.1599 4.0027 0.0270 3.6229 9.1752 4.7836 0.1131 2.0711 10.8564 4.6808 18.8582 5.6483 12.4070 5.4751 17.2730 9.8659 3.7359 11.1846 6.4831 49.0375 0.9232 48.3208 2.8569 34.8348 19.6218 43.7835 7.7562 19.7052 0.6660 16.9078 3.2832 2.3983 5.3564 17.3414 6.3752 3.1247 1.1102 0.7992 1.7091 0.3133 7.1661 20.0529 38.3428 71.2537 9.4482 5.1101 12.5472 5.7129 18.8646 12.8541 29.9184 2.9865 44.3854 0.8964 21.7393 90.7875 61.6981 0.3519 0.6179 0.3998 18.8009 2.2173 20.8110 5.5209 14.6205 5.0645 4.0632 18.6152 4.2955 11.4380 24.2028 7.6890 7.3892 3.2484 10.3306 8.7220 4.4437 4.4078 13.8800 4.7510 2.4973 19.5895 21.6377 22.5949 2.6091 0.5694 15.3607 8.5391 49.2698 10.3093 11.1176 17.9368 248.8258 6.3714 4.0768 9.6828 48.9146 2.9188 44.6775 78.5238 96.2065 32.8920 104.2908 41.0474 26.5320 7.7180 22.2689 38.0983 39.7007 3.8461 2.7825 3.1074 2.4408 25.1444 14.8881 22.7990 21.1231 10.2608 4.0102 8.2209
temp: 298.150 k
press: 1.00000 atm
elementType: 17 8 8 7 7 7 6 6 6 6 6 6 6 6 6 6 6 6 6 6 6 6 6 6 6 6 6 6 1 1 1 1 1 1 1 1 1 1 1 1 1 1 1 1 1 1 1 1 1 1
symmnumber: 1
zpe: 1039488.1 jmol-1
zpe.correction: 0.395920 hartree
zpe.thermalcorrener: 0.419682 hartree
zpe.thermalcorrenthalpy: 0.420626 hartree
zpe.thermalcorrgfe: 0.339587 hartree
zpe.sumelectzpe: -1624.254832 hartree
zpe.sumelectthermal: -1624.231070 hartree
zpe.sumelectthermalent: -1624.230126 hartree
zpe.sumelectthermalfe: -1624.311166 hartree
dipole: -2.8634 0.9915 -0.9845
dipole: 3.1861
quadrupole: -174.0508 -152.3163 -172.1822
quadrupole: 7.4737 -5.4656 0.2953
quadrupole: -7.8677 13.8668 -5.9991 7.4737 -5.4656 0.2953
hfenergy: -1624.6507525 hartree
pointgroup: C01 [X(C22H22Cl1N3O2)]
dipole: -1.1194458 0.4726736 -0.307754 debye
polarizability: 328.0037294|19.5111645|381.4038849|-42.567245|23.0978987|184.5340557 unknown
InChI: InChI=1S/C22H22ClN3O2/c23-20-9-5-4-8-18(20)19-16-21(17-6-2-1-3-7-17)24-26(22(19)27)11-10-25-12-14-28-15-13-25/h1-9,16H,10-15H2
charge 0 multiplicity 1
50 atoms
Cl -3.74616 -0.463944 2.296768
O  7.051234 -1.058307 0.305074
O  0.0355 -2.334178 -0.76043
N  4.174501 -1.000464 -0.071936
N  0.559829 -0.055048 -0.745301
N  0.306931 1.280515 -0.567234
C  2.743864 -0.795459 0.229564
C  4.97035 0.252877 -0.036365
C  4.819552 -2.052517 0.75491
C  1.972039 -0.384184 -1.050899
C  6.405043 -0.022016 -0.517047
C  6.253389 -2.296148 0.25593
C  -0.366561 -1.137949 -0.590676
C  -1.733277 -0.710832 -0.236376
C  -0.958038 1.635977 -0.246981
C  -1.991367 0.647834 -0.095881
C  -2.788724 -1.744158 -0.069402
C  -1.214235 3.090208 -0.066287
C  -3.772984 -1.723312 0.957486
C  -2.863035 -2.828114 -0.994095
C  -2.335634 3.550761 0.676436
C  -0.326532 4.048862 -0.627557
C  -4.788549 -2.693037 1.05786
C  -3.876399 -3.802708 -0.916974
C  -2.567194 4.933094 0.843513
C  -0.559036 5.428169 -0.457992
C  -4.847287 -3.735835 0.107689
C  -1.682973 5.878398 0.275637
H  2.583095 -0.01845 1.016071
H  2.313614 -1.742907 0.599512
H  5.005184 0.678842 0.998093
H  4.503597 1.008254 -0.695967
H  4.23572 -2.98736 0.665249
H  4.855073 -1.766095 1.83583
H  1.991899 -1.223201 -1.762831
H  2.413089 0.514739 -1.507904
H  6.384588 -0.34577 -1.580138
H  7.038748 0.874264 -0.412589
H  6.784348 -3.015032 0.901455
H  6.22138 -2.678874 -0.786969
H  -3.010774 0.97986 0.109816
H  -2.098507 -2.893937 -1.771781
H  -3.017399 2.837145 1.152168
H  0.539348 3.693425 -1.194128
H  -5.514843 -2.635553 1.873331
H  -3.902647 -4.615313 -1.649933
H  -3.433035 5.270879 1.423548
H  0.131648 6.154049 -0.901344
H  -5.637408 -4.490407 0.18066
H  -1.865265 6.950957 0.404514
