program: Gaussian 09
title: 000216746
version: EM64L-G09RevD.01
frameworkgroup: C1[X(C21H25N3)]
method: RPBEPBE
basis: SDD
operation: Freq
keyword: #pfreq=noraman
keyword: PBEPBE/SDD
title: #p freq=noraman PBEPBE/SDD
converged: YES YES NO NO
title: Mulliken charges:
elementType: N N N C C C C C C C C C C C C C C C C C C C C C H H H H H H H H H H H H H H H H H H H H H H H H H
charge: -0.096197 -0.080551 -0.020225 -0.361122 -0.361419 -0.379843 -0.380796 -0.510534 -0.323766 0.283691 0.325056 -0.437208 -0.375830 -0.747479 -0.422108 -0.251334 0.495522 -0.250480 -0.155264 -0.393787 -0.440065 -0.226779 -0.225083 -0.250835 0.224611 0.205321 0.185673 0.205510 0.196100 0.195280 0.190242 0.207676 0.220830 0.227115 0.203066 0.226257 0.264952 0.251044 0.273636 0.236147 0.224250 0.235872 0.226097 0.227059 0.247922 0.231826 0.225700 0.225517 0.228731
chargesum: 0.00000
title: Mulliken charges with hydrogens summed into heavy atoms:
elementType: N N N C C C C C C C C C C C C C C C C C C C C C
charge: -0.096197 -0.080551 -0.020225 0.068811 0.029764 0.011537 0.017122 -0.062588 0.105557 0.283691 0.325056 0.078788 -0.102194 -0.287081 -0.186237 -0.025237 0.495522 -0.023421 -0.155264 -0.145865 -0.208239 -0.001079 0.000434 -0.022104
polarizability: 2.60837249e+02 -1.67502937e+01 2.40835013e+02 -2.16075959e+00 1.66218997e+01 2.03042195e+02
1716.lowfreq: -11.5766 -9.8501 -4.8166 -0.0005 0.0004 0.0009 2.0089 21.3805 29.3690
frequency: -5.7953 21.2322 29.2150 31.4805 39.9827 47.7065 58.5183 73.8193 88.7267 137.6761 140.3972 172.3151 204.1414 219.6697 240.6183 254.9800 269.3450 288.0577 297.7224 329.1933 360.0244 374.7598 401.7585 403.3801 406.3006 441.0959 449.2369 460.3030 480.3394 498.8942 533.8013 554.5846 602.2877 614.3201 620.8372 626.4949 703.5466 728.2483 736.1481 755.5863 761.6867 773.4098 785.5794 794.1579 812.5972 841.2101 846.8008 856.8098 887.6595 903.5013 919.3330 943.0554 948.1902 962.4136 979.7158 988.8386 989.9580 995.9515 1001.3734 1004.1774 1017.4890 1026.3554 1036.6819 1040.2003 1042.0940 1062.3512 1079.7537 1086.8575 1100.3928 1133.3137 1134.9403 1141.8704 1155.2728 1167.5182 1171.2275 1177.7596 1180.1455 1188.3013 1194.6977 1204.8131 1209.0245 1221.9740 1241.5424 1263.8411 1274.5428 1276.4997 1286.4421 1296.9024 1300.9663 1307.5181 1334.5172 1334.9308 1337.1682 1356.7759 1367.2831 1376.3667 1381.5418 1388.6995 1396.2913 1436.5343 1439.6631 1445.4976 1451.9720 1455.1525 1458.2853 1462.9009 1466.3994 1476.1036 1480.6715 1482.2178 1484.7819 1586.9986 1591.9570 1609.7872 1613.9386 2197.0063 2858.8310 2865.3870 2872.8895 2879.7971 2887.7779 2900.2873 2974.5641 2980.9203 3004.7544 3022.4361 3026.1855 3031.6454 3035.3025 3038.2271 3046.3574 3068.0058 3110.9102 3112.3038 3121.4197 3125.8851 3134.2405 3141.3226 3144.0883 3158.1941 3161.6945
redmass: 5.6609 4.6356 2.9323 4.3394 5.4405 3.1924 4.3039 4.6698 3.2949 3.9721 5.4104 3.8809 4.0417 3.5661 2.6356 2.4958 2.8810 2.7501 3.5615 2.2277 3.1506 3.2781 2.0970 2.7366 3.0007 3.1377 4.0025 3.4935 3.0141 3.4659 5.5830 4.9095 5.1089 5.2643 4.1527 2.3336 2.2294 2.2691 2.4247 1.4879 3.5115 1.2807 2.7194 2.9640 3.0275 2.6196 1.9466 1.2482 1.3611 1.4677 2.4133 3.4052 1.7783 1.4880 1.3833 1.6675 6.1084 1.3180 2.3717 1.5475 2.7648 2.2522 2.4249 1.9871 2.1589 1.8118 1.6507 2.1671 2.1458 2.3791 2.6868 2.7647 2.2146 1.0875 1.0597 1.2851 1.9092 1.1209 1.1033 2.1767 1.2484 2.4071 1.3581 1.3958 1.3000 1.4301 1.5709 1.3765 1.3666 1.3103 1.3148 1.3140 1.3583 1.4187 1.5093 2.6450 5.6548 1.4173 1.9064 2.1037 2.1943 1.0851 1.0884 1.0828 1.1089 1.1172 1.2084 1.2783 1.1507 1.9592 1.7126 6.6568 6.0829 6.1915 6.2285 12.4197 1.0708 1.0705 1.0694 1.0702 1.0688 1.0658 1.0609 1.0908 1.0590 1.0994 1.0906 1.0882 1.0906 1.0891 1.0892 1.1009 1.0875 1.0871 1.0858 1.0877 1.0911 1.0932 1.0958 1.1005 1.1014
irintensity: 0.1261 0.4103 1.4527 0.3377 2.6075 4.1720 0.6267 0.5491 1.1571 5.1571 2.1445 0.4286 0.6378 1.3849 0.9346 2.2411 1.1022 0.9077 2.7505 12.1071 1.3763 1.3837 0.8760 0.0580 2.2135 2.4035 6.9428 5.9710 1.6552 4.8128 1.7619 2.6478 4.7326 3.3350 5.6053 1.7731 31.7400 33.8008 35.1482 52.9077 4.9640 4.7268 11.4681 26.0766 7.6173 0.4875 0.9680 0.5148 0.8118 2.2116 4.4464 3.0288 5.5805 5.9486 0.1588 5.5223 0.4871 0.5464 52.8296 1.7066 1.7377 7.3761 11.8145 2.4883 8.0884 0.3643 9.1938 16.3997 5.0985 51.0781 17.6253 50.5201 13.4522 2.5541 0.1811 0.2799 1.4382 1.1064 0.5813 3.0378 0.5412 3.7498 4.8849 8.5093 4.2831 1.1377 13.7958 7.0794 25.9810 4.7922 19.8774 4.8081 9.5516 20.0360 3.1095 3.4103 0.5853 2.5708 2.4311 10.3518 8.7344 7.4642 1.0979 0.3475 13.2933 22.8954 15.7096 21.5392 11.8867 18.8121 5.9694 0.0872 0.9442 8.4615 5.0283 20.8732 83.5356 3.9404 22.3349 25.7322 185.7204 109.6498 32.4840 20.1977 5.2295 14.2419 35.8902 47.9617 32.5268 33.0843 18.5296 17.4807 8.9916 9.5714 0.4751 7.5562 11.7506 16.8913 35.9046 39.8698 23.0920
temp: 298.150 k
press: 1.00000 atm
elementType: 7 7 7 6 6 6 6 6 6 6 6 6 6 6 6 6 6 6 6 6 6 6 6 6 1 1 1 1 1 1 1 1 1 1 1 1 1 1 1 1 1 1 1 1 1 1 1 1 1
symmnumber: 1
zpe: 1081611.5 jmol-1
zpe.correction: 0.411964 hartree
zpe.thermalcorrener: 0.433354 hartree
zpe.thermalcorrenthalpy: 0.434298 hartree
zpe.thermalcorrgfe: 0.359089 hartree
zpe.sumelectzpe: -977.692598 hartree
zpe.sumelectthermal: -977.671208 hartree
zpe.sumelectthermalent: -977.670264 hartree
zpe.sumelectthermalfe: -977.745474 hartree
dipole: 4.3040 0.0155 1.5034
dipole: 4.5590
quadrupole: -192.4867 -139.4970 -134.9381
quadrupole: 3.5744 -11.0390 2.1674
quadrupole: -36.8461 16.1436 20.7025 3.5744 -11.0390 2.1674
hfenergy: -978.1045625 hartree
pointgroup: C01 [X(C21H25N3)]
dipole: -1.6888858 0.0173431 -0.6037587 debye
polarizability: 261.8402244|16.0433721|237.591191|-3.3479932|-18.689066|205.2830409 unknown
InChI: InChI=1S/C21H25N3/c22-11-6-12-23-13-15-24(16-14-23)18-21-10-5-4-9-20(21)17-19-7-2-1-3-8-19/h1-5,7-10H,6,12-18H2
charge 0 multiplicity 1
49 atoms
N  0.48504 -1.199373 -0.920901
N  3.258351 -0.454515 -0.503947
N  7.791288 0.47153 1.19744
C  0.873867 -0.267099 0.167342
C  1.42675 -1.079221 -2.059089
C  2.307385 -0.560776 0.634118
C  2.860801 -1.382583 -1.594863
C  -0.930499 -1.024696 -1.331401
C  4.671034 -0.618432 -0.105307
C  -1.921943 -1.542953 -0.287715
C  -3.203087 -0.942694 -0.103308
C  5.211365 0.679431 0.562011
C  -1.578271 -2.688792 0.471956
C  -3.640775 0.303217 -0.873106
C  -4.097671 -1.51632 0.836765
C  -2.476568 -3.246886 1.406589
C  -2.939358 1.602171 -0.455736
C  -3.748126 -2.658566 1.589871
C  6.634976 0.573835 0.919452
C  -2.642745 1.870923 0.905089
C  -2.611219 2.583111 -1.426489
C  -2.036947 3.089782 1.284918
C  -2.006508 3.803957 -1.050524
C  -1.71601 4.062049 0.309015
H  0.17512 -0.397549 1.012641
H  0.809336 0.797276 -0.170093
H  1.40606 -0.05364 -2.507341
H  1.135307 -1.803981 -2.842611
H  2.584997 0.170358 1.415253
H  2.340547 -1.582184 1.090481
H  2.91058 -2.450668 -1.265554
H  3.557002 -1.249085 -2.443686
H  -1.071476 -1.601106 -2.269242
H  -1.149575 0.041324 -1.574819
H  4.827692 -1.482205 0.586614
H  5.269016 -0.817053 -1.013245
H  5.064838 1.522098 -0.138332
H  4.635985 0.914206 1.476912
H  -0.584252 -3.12233 0.315414
H  -4.73121 0.433484 -0.723017
H  -3.502614 0.160444 -1.962321
H  -5.084282 -1.056491 0.976254
H  -2.189604 -4.1341 1.982563
H  -4.458596 -3.08241 2.308463
H  -2.880373 1.117859 1.665374
H  -2.83314 2.390087 -2.484094
H  -1.816083 3.281514 2.341428
H  -1.760309 4.549666 -1.815143
H  -1.245998 5.007085 0.603523
