program: Gaussian 09
title: 000216846
version: EM64L-G09RevD.01
frameworkgroup: C1[X(C13H28ClN2O8PS2)]
method: RPBEPBE
basis: SDD
operation: Freq
keyword: #p
keyword: freq=noraman
keyword: PBEPBE/SDD
title: #p freq=noraman PBEPBE/SDD
converged: YES YES NO NO
title: Mulliken charges:
elementType: Cl S S P O O O O O O O O N N C C C C C C C C C C C C C H H H H H H H H H H H H H H H H H H H H H H H H H H H H
charge: -0.086085 1.063842 1.066870 1.316349 -0.471708 -0.609569 -0.403989 -0.417779 -0.506686 -0.574177 -0.532322 -0.505645 -0.504252 -0.543706 -0.351282 -0.361714 -0.349921 -0.291504 -0.313090 -0.265691 -0.394711 -0.374125 -0.589577 -0.299312 -0.358435 -0.714380 -0.793220 0.231134 0.231187 0.231787 0.204730 0.238180 0.253210 0.242623 0.236191 0.238173 0.219747 0.240492 0.239477 0.225549 0.286994 0.235042 0.231255 0.327747 0.265127 0.239034 0.246867 0.270434 0.225951 0.295128 0.286904 0.291218 0.281113 0.350865 0.299660
chargesum: 0.00000
title: Mulliken charges with hydrogens summed into heavy atoms:
elementType: Cl S S P O O O O O O O O N N C C C C C C C C C C C C C
charge: -0.086085 1.063842 1.066870 1.316349 -0.471708 -0.609569 -0.403989 -0.417779 -0.506686 -0.574177 -0.532322 -0.505645 -0.504252 -0.543706 0.111039 0.074803 0.141469 0.187310 0.144830 0.214278 0.117832 0.092172 0.003297 0.186589 0.137950 0.158870 0.138417
polarizability: 3.04698927e+02 2.15601505e+00 2.70151686e+02 1.17425123e+01 6.78398912e+00 2.33368221e+02
1716.lowfreq: -7.5419 -4.5677 -3.1126 0.0022 0.0023 0.0027 16.7359 22.8987 29.5103
frequency: 16.5590 22.8667 29.5045 38.2422 42.3530 46.2285 50.8634 60.5808 67.3131 73.0533 76.3009 87.3323 91.1523 96.1548 108.5614 125.7090 143.9544 151.8919 153.6165 171.6092 177.1358 178.6893 194.7091 207.7493 213.7440 218.4088 222.8533 237.7960 240.4545 252.8716 269.4502 272.8921 279.0366 284.8712 293.1195 317.0131 337.7107 339.7577 341.4757 344.9552 375.9109 381.6280 392.2361 404.3321 407.8323 417.0088 423.1494 456.8596 479.3784 496.4509 520.9528 539.0743 583.3818 589.9899 605.3552 645.0725 673.1963 689.5795 752.0749 771.3188 779.8137 825.9711 828.7395 830.2677 847.3789 864.5880 874.2271 881.0244 893.0485 904.1314 913.0007 915.4659 928.6266 932.3913 997.4346 1003.6198 1006.7194 1012.2475 1024.4450 1030.3990 1037.7687 1047.4424 1053.2772 1059.9878 1064.0877 1066.3971 1075.4951 1098.2180 1103.9453 1110.9520 1136.2403 1142.6299 1188.5243 1195.5900 1199.8600 1205.7191 1240.4842 1246.6821 1263.4007 1265.9006 1269.1050 1291.8803 1296.7149 1302.6263 1320.1087 1332.8133 1336.0826 1343.6768 1344.5833 1352.2701 1352.9873 1358.0119 1369.7890 1373.4342 1376.9635 1384.6619 1415.2193 1417.8787 1429.3201 1434.3287 1439.5953 1443.8907 1448.1812 1453.9512 1459.9066 1465.0345 1465.8857 1468.3404 1478.7967 1482.1696 1484.4141 2925.5959 2959.2399 2966.2684 2967.4803 2974.5871 2987.8692 2989.4471 2995.0970 2997.6325 2998.5281 3006.4760 3033.9044 3040.4933 3041.5014 3048.3223 3052.4329 3055.8633 3061.0844 3061.2500 3062.4616 3067.4361 3076.4794 3090.3466 3143.5189 3146.7238 3165.3934 3189.9585 3198.9973
redmass: 9.3390 5.4726 9.1552 5.5429 6.3883 7.2575 6.0142 6.3611 5.3393 6.7821 5.3722 4.2532 4.2131 6.2777 3.0757 3.5002 4.0777 1.5339 1.5662 3.5747 3.3520 4.4780 5.5937 5.0483 4.7252 4.6373 5.4079 4.2261 3.0160 2.1444 3.1868 2.8782 1.3574 4.1752 3.2131 3.9747 4.6917 5.7873 5.3408 3.5407 4.4302 5.3009 3.9939 5.0292 4.4119 4.2171 2.8769 4.2594 4.3025 4.6527 3.3525 2.4797 8.8023 4.8847 8.2921 9.5251 4.8796 4.5274 1.5464 1.1892 3.4043 2.7453 10.9263 9.2898 2.7725 2.0855 1.8297 2.8991 2.8225 3.4104 2.2339 2.5391 3.0624 2.3464 1.4303 1.2954 1.9286 4.9754 2.2512 1.9316 2.7039 3.8380 1.9282 1.7901 2.1838 2.2605 2.3786 2.7164 2.0640 2.5802 2.8678 3.2399 1.3098 1.1232 1.3526 1.1612 1.4015 1.1742 1.1944 1.1441 1.1786 1.1777 1.1603 1.1174 1.1326 1.2282 1.3261 1.1307 1.2395 1.3759 1.2460 1.2712 1.3974 1.3150 1.2838 1.3077 1.0516 1.0496 1.0452 1.0519 1.0909 1.0803 1.0773 1.0747 1.0763 1.0831 1.0773 1.0914 1.0826 1.0810 1.0750 1.0693 1.0672 1.0595 1.0666 1.0652 1.0652 1.0600 1.0626 1.0255 1.0618 1.0629 1.1024 1.0917 1.0248 1.0976 1.0936 1.0644 1.0980 1.0944 1.0996 1.1002 1.1015 1.1018 1.1092 1.1129 1.1073 1.1079 1.1078
irintensity: 0.9741 1.1259 1.4547 1.5962 3.0439 0.4428 1.5981 2.7704 2.0766 3.2958 2.6720 0.8153 4.7754 7.8314 4.6263 5.9228 3.3081 2.7323 3.3414 5.5046 9.8838 3.0464 0.8848 2.8559 2.5217 1.2567 14.4606 14.2011 0.9575 1.0218 19.0868 1.5004 0.1218 14.2635 2.6653 11.9583 3.3046 2.8564 43.6048 8.3013 8.7126 14.1320 11.3705 25.5373 12.8789 3.1489 23.7317 6.6029 134.0713 16.2359 5.5908 32.1087 27.1685 31.2904 61.3858 20.5064 162.0444 63.0051 5.0403 16.0501 46.3382 68.5210 138.7247 9.0290 17.3982 49.4712 49.0618 61.6801 29.6047 39.7431 26.0942 44.0733 63.1807 2.3314 50.7781 25.0199 55.1492 117.9514 23.0262 41.2768 71.2764 17.5541 69.6291 52.2418 4.5687 20.1645 17.5778 12.6113 23.4256 19.8125 53.3580 65.5094 5.9845 3.1798 20.2594 5.7824 9.7454 13.8313 10.1244 7.7901 4.3716 0.5650 14.5718 8.9759 1.8584 14.4558 6.4991 0.9852 6.4502 2.6513 11.7745 2.6379 1.4929 6.9097 2.1531 1.1528 13.3217 12.7451 5.8211 16.4748 15.2649 11.7272 24.7740 11.1582 4.5331 12.2785 24.2169 4.6282 4.4106 16.9799 11.8130 60.1430 28.4642 18.8805 50.0126 31.2126 46.7368 12.0124 37.5035 44.2665 31.1866 5.6076 14.9601 19.5717 0.6914 12.7881 4.7104 7.5884 20.6660 10.1746 6.9651 36.1419 21.0459 24.1085 45.5224 3.6159 8.9196 0.1365 0.0712
temp: 298.150 k
press: 1.00000 atm
elementType: 17 16 16 15 8 8 8 8 8 8 8 8 7 7 6 6 6 6 6 6 6 6 6 6 6 6 6 1 1 1 1 1 1 1 1 1 1 1 1 1 1 1 1 1 1 1 1 1 1 1 1 1 1 1 1
symmnumber: 1
zpe: 1118965.8 jmol-1
zpe.correction: 0.426192 hartree
zpe.thermalcorrener: 0.460069 hartree
zpe.thermalcorrenthalpy: 0.461013 hartree
zpe.thermalcorrgfe: 0.358231 hartree
zpe.sumelectzpe: -2818.311391 hartree
zpe.sumelectthermal: -2818.277513 hartree
zpe.sumelectthermalent: -2818.276569 hartree
zpe.sumelectthermalfe: -2818.379351 hartree
dipole: -0.6054 -4.2369 2.0605
dipole: 4.7501
quadrupole: -167.5835 -212.4459 -197.5214
quadrupole: -43.1824 20.1606 0.2004
quadrupole: 24.9335 -19.9289 -5.0045 -43.1824 20.1606 0.2004
hfenergy: -2818.7375822 hartree
pointgroup: C01 [X(C13H28Cl1N2O8P1S2)]
dipole: -1.760963 -0.5702734 -0.2576841 debye
polarizability: 265.2994342|-9.2413833|299.0106825|-12.2863469|-21.2821018|243.9087173 unknown
InChI: InChI=1S/C13H28ClN2O8PS2/c1-26(18,19)23-12-4-8-15(9-5-13-24-27(2,20)21)25(17)16(10-6-14)7-3-11-22-25/h3-13H2,1-2H3
charge 0 multiplicity 1
55 atoms
Cl 1.939074 -0.155469 -3.60702
S  -2.675239 2.729689 0.143601
S  2.813806 3.316579 -0.613007
P  -0.216053 -2.789236 0.674899
O  0.577391 -3.477664 2.082212
O  -1.499131 -3.610104 0.185846
O  -3.662275 1.275184 -0.433457
O  2.521475 1.646435 0.276429
O  -2.500348 2.729691 1.752936
O  -1.34844 2.876755 -0.788567
O  2.384522 4.498742 0.416431
O  4.304208 3.245907 -1.224088
N  1.156239 -2.698496 -0.434572
N  -0.53233 -1.137453 1.128729
C  2.000086 -3.930216 -0.529761
C  2.527582 -4.386755 0.846664
C  -1.908076 -0.806356 1.626256
C  0.61955 -0.407208 1.751927
C  1.385151 -4.702267 1.824967
C  0.960019 -1.967398 -1.711133
C  -3.011365 -0.955481 0.552903
C  0.508726 1.126464 1.609102
C  2.137678 -1.003276 -1.91324
C  -2.911033 -0.004464 -0.643104
C  1.885767 1.809337 1.60964
C  -3.981778 3.99936 -0.368157
C  1.529417 3.183471 -2.00157
H  1.432541 -4.757622 -1.013695
H  2.854653 -3.69244 -1.188535
H  3.167112 -3.595064 1.277497
H  3.148473 -5.293415 0.707908
H  -2.175892 -1.439719 2.497314
H  -1.871241 0.236999 1.986294
H  1.530874 -0.76104 1.238776
H  0.717804 -0.684382 2.822675
H  1.758891 -4.997887 2.818406
H  0.722424 -5.500606 1.433891
H  0.019968 -1.389693 -1.668365
H  0.880435 -2.666668 -2.568356
H  -3.995416 -0.806215 1.037071
H  -2.992578 -1.996302 0.17847
H  -0.106412 1.5592 2.419804
H  0.007776 1.385196 0.659317
H  2.163831 -0.19453 -1.168581
H  3.109944 -1.514459 -1.968959
H  -1.861076 0.218358 -0.920577
H  -3.423038 -0.419488 -1.530266
H  1.790914 2.892217 1.832706
H  2.586223 1.366991 2.343657
H  -4.897211 3.723407 0.171201
H  -3.586429 4.977352 -0.061178
H  -4.088003 3.901554 -1.455716
H  1.649174 4.099741 -2.597715
H  0.546606 3.11542 -1.509727
H  1.787836 2.275327 -2.565983
