program: Gaussian 09
title: 000216736
version: EM64L-G09RevD.01
frameworkgroup: C1[X(C18H22N2)]
method: RPBEPBE
basis: SDD
operation: Freq
keyword: #pfreq=noraman
keyword: PBEPBE/SDD
title: #p freq=noraman PBEPBE/SDD
converged: YES YES NO NO
title: Mulliken charges:
elementType: N N C C C C C C C C C C C C C C C C C C H H H H H H H H H H H H H H H H H H H H H H
charge: -0.084323 -0.293359 -0.306301 -0.317261 -0.566564 -0.443208 -0.426584 0.350274 0.319733 -0.690943 -0.442782 -0.388471 0.476531 -0.244224 -0.258991 -0.390258 -0.388610 -0.251632 -0.240220 -0.250902 0.189939 0.216326 0.193324 0.190856 0.201599 0.213704 0.220675 0.203149 0.202785 0.198543 0.264816 0.220318 0.239968 0.238121 0.246126 0.226508 0.227349 0.249572 0.224260 0.222433 0.222220 0.225507
chargesum: 0.00000
title: Mulliken charges with hydrogens summed into heavy atoms:
elementType: N N C C C C C C C C C C C C C C C C C C
charge: -0.084323 -0.028543 0.099963 0.066919 -0.151261 -0.019385 -0.025256 0.350274 0.319733 -0.230658 -0.204661 -0.142345 0.476531 -0.017716 -0.031643 -0.140686 -0.164350 -0.029199 -0.018001 -0.025395
polarizability: 2.36072423e+02 1.10649159e+01 1.85014968e+02 -1.83273857e+01 6.50825985e+00 1.67902970e+02
1716.lowfreq: -18.0196 -10.5011 -9.5518 -0.0009 -0.0009 -0.0008 3.8938 22.4468 40.9524
frequency: -12.8671 20.6643 40.8704 51.3267 62.7690 77.6779 140.8682 159.6288 190.9377 235.7955 249.8166 266.1696 286.8255 308.1660 327.6460 384.8574 391.6819 400.3341 425.7609 455.0964 458.2485 468.7277 494.1291 551.4440 572.5519 608.6521 616.0829 624.2207 698.4112 699.2973 724.0247 732.8466 744.3545 777.7028 783.3201 802.2873 846.0962 851.2266 854.5201 880.9860 885.4682 891.4094 915.0446 946.2309 951.2902 976.1459 984.6810 988.6587 989.3740 992.4653 1008.7163 1027.2176 1047.4122 1054.2403 1063.2175 1081.0988 1092.5616 1107.0235 1122.8005 1132.8726 1160.2211 1169.6031 1172.4729 1181.5032 1188.9863 1189.5997 1196.1600 1200.8858 1207.8712 1228.8546 1260.7884 1274.1726 1274.5575 1298.8668 1302.7908 1319.0109 1330.3098 1333.6046 1354.9961 1377.3607 1383.4341 1385.0643 1391.2139 1436.0086 1438.5480 1444.0525 1450.1751 1450.8971 1456.2533 1461.3921 1468.3648 1477.0313 1483.2956 1487.3606 1587.3285 1591.6613 1610.1823 1614.2009 2837.2785 2853.3077 2864.7306 2882.0447 2905.5715 2961.3609 2978.2152 3014.8849 3034.4591 3038.0695 3044.0512 3046.5164 3108.8822 3111.6803 3116.3392 3120.3916 3133.3806 3135.8451 3145.8091 3158.1206 3159.9228 3450.4475
redmass: 3.6256 3.9078 4.2385 3.5065 4.2439 4.5001 3.5125 4.1247 3.4726 3.2229 3.0254 2.7385 2.4487 3.2399 2.3591 2.3417 1.9479 2.8362 3.1879 2.9669 2.9037 3.5029 3.0338 3.0498 2.5987 4.2054 5.7267 5.3938 2.6642 1.6937 1.8114 2.6464 1.6117 3.7945 2.1254 3.2133 1.6759 2.1758 1.3547 1.5406 2.3642 1.6130 2.1520 1.8446 1.4111 1.3736 1.7597 1.3774 5.9757 1.3159 2.5521 2.2630 2.1941 1.7105 1.8092 1.6025 2.1343 2.1616 2.5352 2.5323 3.4726 1.0636 1.0801 2.4197 1.1261 1.3656 1.0970 1.2017 1.6661 1.9041 1.4272 1.7418 1.4181 1.3007 1.3405 1.2433 1.3109 1.3001 1.3852 3.2871 2.7255 2.0932 1.8157 2.1376 2.2800 1.3516 1.1154 1.0836 1.0787 1.1161 1.1079 1.2193 2.1994 2.0868 6.5964 6.0772 6.1519 6.1485 1.0711 1.0705 1.0692 1.0689 1.0680 1.0668 1.0858 1.0901 1.0899 1.0931 1.0883 1.0913 1.0866 1.0863 1.0892 1.0861 1.0922 1.0927 1.0946 1.1006 1.1011 1.0751
irintensity: 0.0203 0.1116 0.0428 0.0127 0.2458 0.2587 2.3453 0.2668 3.9669 0.6566 1.9534 1.6781 6.0032 1.8950 0.5723 4.8729 0.2610 0.1050 1.5266 14.0740 0.3995 10.2890 37.8405 19.1708 21.5187 6.4186 1.9586 3.7438 14.4924 109.3992 38.7362 12.5291 59.6464 3.3121 42.1520 7.9390 0.0184 0.9150 1.3695 0.8816 3.0962 0.2263 6.1686 4.9292 2.9352 0.1760 2.8893 0.4511 0.4089 0.3112 31.9237 9.4467 7.5064 1.5876 14.6815 8.0151 6.7532 4.8614 23.7281 18.9951 19.0101 0.1052 0.0395 1.0736 1.4709 2.1658 0.1541 0.6846 4.7535 2.1907 5.4190 0.5595 9.7874 1.9378 5.9339 31.3632 11.0503 2.5810 4.1052 0.2855 1.8939 0.1506 2.5494 8.4289 6.2840 1.7171 21.2530 1.3080 2.7647 9.2300 7.8007 14.9896 21.5343 18.7561 0.9354 0.8220 13.2628 6.9081 60.8771 63.4465 128.8416 125.6928 96.4886 31.3393 19.2094 45.6518 65.8648 59.9633 17.0156 14.3552 8.5694 13.6832 3.3967 0.1268 25.3748 28.9825 29.9420 39.1448 21.5594 1.8610
temp: 298.150 k
press: 1.00000 atm
elementType: 7 7 6 6 6 6 6 6 6 6 6 6 6 6 6 6 6 6 6 6 1 1 1 1 1 1 1 1 1 1 1 1 1 1 1 1 1 1 1 1 1 1
symmnumber: 1
zpe: 940649.6 jmol-1
zpe.correction: 0.358275 hartree
zpe.thermalcorrener: 0.375013 hartree
zpe.thermalcorrenthalpy: 0.375958 hartree
zpe.thermalcorrgfe: 0.312879 hartree
zpe.sumelectzpe: -807.125420 hartree
zpe.sumelectthermal: -807.108681 hartree
zpe.sumelectthermalent: -807.107737 hartree
zpe.sumelectthermalfe: -807.170816 hartree
dipole: 0.4247 -0.0591 -0.2467
dipole: 0.4947
quadrupole: -110.1274 -122.4581 -113.6900
quadrupole: 1.9199 -3.6330 2.8717
quadrupole: 5.2978 -7.0329 1.7351 1.9199 -3.6330 2.8717
hfenergy: -807.4836949 hartree
pointgroup: C01 [X(C18H22N2)]
dipole: -0.1694742 0.0285985 0.0913356 debye
polarizability: 229.7340909|-23.436215|190.1767489|-14.6860603|-6.7377475|169.0795216 unknown
InChI: InChI=1S/C18H22N2/c1-2-6-16(7-3-1)14-17-8-4-5-9-18(17)15-20-12-10-19-11-13-20/h1-9,19H,10-15H2
charge 0 multiplicity 1
42 atoms
N  -0.816327 -1.553816 0.595861
N  -3.403236 -1.844731 -0.607727
C  -0.953111 -1.914706 -0.837626
C  -1.979246 -2.0320 1.38473
C  0.47432 -1.985915 1.182929
C  -2.261766 -1.341629 -1.409228
C  -3.282605 -1.446216 0.812597
C  1.694078 -1.293786 0.580773
C  1.890404 0.118509 0.668371
C  0.869686 1.052984 1.303754
C  2.692359 -2.0914 -0.034786
C  3.089344 0.671696 0.147658
C  -0.074837 1.780264 0.334994
C  3.875728 -1.526321 -0.558718
C  4.077507 -0.131768 -0.461958
C  0.156002 1.852897 -1.06016
C  -1.219515 2.435104 0.861693
C  -0.731708 2.559235 -1.906158
C  -2.106498 3.143644 0.022861
C  -1.865986 3.209242 -1.370415
H  -0.954192 -3.026429 -0.974768
H  -0.093076 -1.497932 -1.391522
H  -1.85337 -1.704373 2.434999
H  -2.054897 -3.149174 1.374314
H  0.616949 -3.094205 1.093448
H  0.42318 -1.765395 2.269248
H  -2.186167 -0.228292 -1.399981
H  -2.381162 -1.677176 -2.456027
H  -4.145764 -1.845493 1.376809
H  -3.251111 -0.336815 0.947138
H  -4.311423 -1.582593 -1.0124
H  1.416351 1.824644 1.885758
H  0.241338 0.500266 2.023988
H  2.535305 -3.175392 -0.098531
H  3.248358 1.754379 0.230702
H  4.631035 -2.165536 -1.029374
H  4.993659 0.324995 -0.852925
H  1.027944 1.349432 -1.491029
H  -1.418525 2.383758 1.940115
H  -0.534686 2.600962 -2.983895
H  -2.983588 3.641647 0.45268
H  -2.552154 3.758034 -2.025489
