program: Gaussian 09
title: 000216724
version: EM64L-G09RevD.01
frameworkgroup: C1[X(C11H24NO2)]
method: RPBEPBE
basis: SDD
operation: Freq
keyword: #p
keyword: freq=noraman
keyword: PBEPBE/SDD
title: #p freq=noraman PBEPBE/SDD
converged: YES YES NO NO
title: Mulliken charges:
elementType: O O N C C C C C C C C C C C H H H H H H H H H H H H H H H H H H H H H H H H
charge: -0.246803 -0.277854 -0.105613 -0.356017 -0.292263 -0.293207 -0.580100 -0.406996 -0.720634 -0.703084 -0.527712 0.273167 -0.265555 -0.652660 0.312215 0.247915 0.246864 0.251714 0.268056 0.256807 0.262423 0.267317 0.271837 0.242671 0.237615 0.299023 0.236393 0.261038 0.240070 0.246821 0.269966 0.255849 0.284323 0.243540 0.237416 0.238464 0.239241 0.237755
chargesum: 1.00000
title: Mulliken charges with hydrogens summed into heavy atoms:
elementType: O O N C C C C C C C C C C C
charge: -0.246803 -0.277854 -0.105613 0.204113 0.206315 0.231656 0.221476 0.073290 0.075821 0.053772 0.012459 0.273167 0.215401 0.062800
polarizability: 1.56600811e+02 6.46584641e-01 1.22492057e+02 7.00713702e-01 1.71250235e+00 1.11919182e+02
1716.lowfreq: -20.8166 -9.5680 -5.9995 -0.0005 -0.0004 0.0004 14.6587 27.8327 46.0771
frequency: -4.5150 27.7070 46.0448 72.1194 78.0157 98.1206 105.6375 147.3413 168.2324 183.6568 212.9656 234.3314 239.9909 246.7553 275.0692 303.5045 307.1338 321.7539 350.6287 367.6224 387.9267 441.4549 451.5467 488.6658 529.2806 561.9941 628.6742 690.9508 750.9387 780.5772 789.6866 796.3920 812.6701 839.7460 860.5329 876.4687 902.2266 956.3493 998.0056 1014.7764 1022.0572 1033.8211 1062.4158 1069.9461 1079.2080 1096.3321 1117.8015 1120.7374 1150.1339 1156.7151 1166.9109 1185.7166 1207.4987 1209.1126 1258.5707 1276.9372 1288.1090 1303.8813 1322.0875 1334.2626 1343.0269 1353.7105 1364.8276 1372.0464 1381.1771 1397.5359 1413.8403 1421.8071 1435.5305 1442.8547 1457.1572 1460.4421 1462.4138 1465.3550 1471.6198 1474.2856 1476.7382 1482.2328 1484.9862 1487.7097 1492.0976 1495.3362 1507.5150 1612.4453 2996.8724 2999.2235 3006.8469 3008.1887 3015.8691 3025.6961 3029.3498 3031.6829 3039.1383 3040.9051 3067.2091 3077.5850 3085.7950 3089.0774 3094.8511 3095.1219 3097.9754 3101.6722 3110.9472 3118.6858 3122.3532 3130.4687 3140.9727 3152.7379
redmass: 3.0084 3.0832 4.8793 2.3241 3.3417 2.5508 2.8219 2.1194 2.2047 1.7860 1.1557 2.0472 1.6040 1.7914 1.4020 1.3715 1.9376 3.1965 2.5337 2.3843 3.4662 2.8112 2.7186 2.7926 2.5908 3.2824 3.5443 2.8710 1.5579 1.6214 1.8985 1.1913 1.5332 1.7698 2.4470 2.5789 2.4085 2.4515 2.3778 2.0751 2.1291 2.0637 2.1842 1.8950 2.0872 2.1971 1.8996 1.6113 1.6467 1.6536 1.6847 3.2046 1.6730 1.5156 1.3534 1.1368 1.1204 1.1551 1.2808 1.1957 1.3289 1.2968 1.5352 1.2995 1.3468 1.2267 1.1966 1.1799 1.1589 1.0932 1.0866 1.0920 1.0610 1.0426 1.0698 1.0687 1.0584 1.0536 1.0647 1.0413 1.0492 1.0696 1.0579 7.3925 1.0379 1.0362 1.0641 1.0374 1.0600 1.0582 1.0572 1.0403 1.0603 1.0600 1.0969 1.1025 1.1030 1.0985 1.0985 1.1002 1.1003 1.1017 1.1034 1.1059 1.1034 1.1077 1.1040 1.1043
irintensity: 0.1657 0.9996 1.8981 0.7820 1.8630 1.2972 4.7017 0.6443 2.1561 5.8937 0.3714 4.0890 0.9505 0.2002 1.9095 0.1068 2.6469 24.0358 0.4053 1.0283 5.8214 1.0349 1.8245 1.0241 1.1553 2.7077 2.3933 1.2152 25.6539 20.8413 11.5352 10.8059 12.0918 3.8113 11.7677 3.7826 13.7434 13.3237 35.3073 31.8417 25.6128 12.5123 2.0353 8.0600 26.9225 21.4217 1.2105 20.5170 41.5472 4.1061 13.9232 316.7643 2.9083 2.0006 11.8818 14.8394 4.1831 6.1415 2.0613 19.9363 18.7225 4.1146 32.2477 1.5414 5.2854 22.8150 27.0168 25.4047 34.8757 40.2006 12.1445 10.5794 1.3559 16.6687 24.0467 9.2088 17.0443 13.7144 20.5810 22.8330 21.1571 36.1291 3.3391 209.7561 15.4648 9.1902 6.2147 4.0596 8.9714 11.7792 8.4399 11.7607 9.5469 20.4938 2.7494 11.5818 4.2636 10.3003 20.5451 5.2280 1.9565 5.9458 12.3949 5.4948 23.1740 21.7350 7.3381 5.0780
temp: 298.150 k
press: 1.00000 atm
elementType: 8 8 7 6 6 6 6 6 6 6 6 6 6 6 1 1 1 1 1 1 1 1 1 1 1 1 1 1 1 1 1 1 1 1 1 1 1 1
symmnumber: 1
zpe: 898656.7 jmol-1
zpe.correction: 0.342280 hartree
zpe.thermalcorrener: 0.359188 hartree
zpe.thermalcorrenthalpy: 0.360132 hartree
zpe.thermalcorrgfe: 0.297660 hartree
zpe.sumelectzpe: -637.365915 hartree
zpe.sumelectthermal: -637.349007 hartree
zpe.sumelectthermalent: -637.348063 hartree
zpe.sumelectthermalfe: -637.410535 hartree
dipole: -7.3293 -0.6449 -0.7285
dipole: 7.3936
quadrupole: -32.9325 -77.8962 -75.4921
quadrupole: 0.6022 2.2055 -0.3336
quadrupole: 29.1745 -15.7893 -13.3852 0.6022 2.2055 -0.3336
hfenergy: -637.7081955 hartree
pointgroup: C01 [X(C11H24N1O2)]
dipole: -2.880931 0.3434458 0.2090087 debye
polarizability: 156.4206903|-2.5277929|121.5096544|1.2456401|3.6277811|113.0817057 unknown
InChI: InChI=1S/C11H24NO2/c1-5-12(4,6-2)10-8-9-11(13)14-7-3/h5-10H2,1-4H3
charge 1 multiplicity 1
38 atoms
O  3.309657 0.583411 0.184873
O  1.61188 -0.922359 -0.351729
N  -2.457793 -0.199832 0.148288
C  -1.073989 0.49096 0.100294
C  -2.325133 -1.724068 0.452711
C  -3.154333 -0.037069 -1.233194
C  -3.324919 0.413776 1.241356
C  -0.244312 0.397248 1.394589
C  -1.442387 -2.518211 -0.515974
C  -3.554004 1.393405 -1.613859
C  1.172704 0.976557 1.172746
C  2.027619 0.100195 0.256866
C  4.308373 -0.174165 -0.657672
C  5.004736 -1.244858 0.181568
H  -0.521841 0.019425 -0.727017
H  -1.269006 1.547163 -0.151681
H  -3.361385 -2.107068 0.460892
H  -1.931836 -1.7948 1.480059
H  -2.452794 -0.451326 -1.974644
H  -4.044632 -0.689914 -1.196422
H  -4.347301 0.013791 1.155196
H  -2.910325 0.147611 2.224186
H  -3.341967 1.50745 1.133075
H  -0.724478 0.959627 2.215397
H  -0.135782 -0.65379 1.714759
H  -0.395931 -2.168597 -0.527223
H  -1.835644 -2.535573 -1.546049
H  -1.432135 -3.565971 -0.165395
H  -2.694474 2.079275 -1.695365
H  -4.302608 1.830457 -0.933027
H  -4.01968 1.350209 -2.614385
H  1.13876 2.000307 0.752361
H  1.697713 1.072388 2.139933
H  5.00081 0.61404 -0.99002
H  3.773004 -0.607635 -1.519732
H  5.791829 -1.728026 -0.425525
H  5.484687 -0.803268 1.071066
H  4.296517 -2.026965 0.503297
