program: Gaussian 09
title: 000216720
version: EM64L-G09RevD.01
frameworkgroup: C1[X(C10H11Br2NO2)]
method: RPBEPBE
basis: SDD
operation: Freq
keyword: #p
keyword: freq=noraman
keyword: PBEPBE/SDD
title: #p freq=noraman PBEPBE/SDD
converged: YES YES NO NO
title: Mulliken charges:
elementType: Br Br O O N C C C C C C C C C C H H H H H H H H H H H
charge: -0.019850 -0.006435 -0.444995 -0.205007 0.037375 -0.381003 -0.545234 -0.418318 0.526574 -0.664458 -0.323899 -0.550549 -0.250870 -0.019478 0.148334 0.258171 0.262680 0.235385 0.232125 0.326263 0.314069 0.307812 0.252915 0.259185 0.281832 0.387375
chargesum: 0.00000
title: Mulliken charges with hydrogens summed into heavy atoms:
elementType: Br Br O O N C C C C C C C C C C
charge: -0.019850 -0.006435 -0.057619 -0.205007 0.037375 0.139848 -0.077724 -0.092055 0.526574 -0.042576 -0.070984 -0.291364 0.030962 -0.019478 0.148334
polarizability: 1.98991419e+02 8.41975850e+00 1.86881275e+02 -1.22910163e+01 -1.20848277e+00 8.11306618e+01
1716.lowfreq: -6.7533 -0.0001 0.0005 0.0005 2.3653 4.5614 12.3162 18.4121 42.4210
frequency: 11.8676 18.3659 42.4033 50.1807 56.3638 92.1268 128.8156 155.6511 173.2918 191.1359 197.3115 290.2482 310.7830 336.3123 373.4628 399.2391 477.2844 490.8905 504.0596 529.4817 588.0239 600.9547 608.2212 629.8163 689.6446 718.6481 777.2301 790.5845 820.7066 850.9244 883.5968 911.0420 944.2185 993.4767 1000.1129 1004.3270 1007.5311 1031.5509 1111.3055 1131.5901 1137.5319 1161.7950 1167.6641 1187.5041 1226.8764 1238.3903 1278.1844 1285.0303 1292.2760 1309.9731 1332.1958 1341.4387 1365.0647 1379.4368 1448.7022 1454.0579 1464.5532 1482.1308 1547.4423 1585.0990 1670.7844 2987.0175 2994.7925 3043.0865 3065.0793 3078.6655 3084.7639 3115.7764 3133.5748 3166.8972 3189.1743 3532.8387
redmass: 6.6662 14.2943 6.9001 7.4949 6.7243 9.3758 5.6083 3.2496 23.8209 5.0211 3.4588 2.6565 4.6631 3.1974 5.2298 3.1676 5.3900 3.6747 4.0033 4.4782 1.5438 2.7195 3.9938 7.5028 3.8348 4.2127 1.2806 4.7667 4.5591 2.2343 1.7597 1.7682 1.4843 1.8438 1.5394 3.3599 3.4199 1.9208 1.2812 1.3923 1.7249 1.2536 2.0083 1.3640 2.2679 1.1647 1.3585 1.3460 1.5050 2.6531 5.8404 1.5451 1.4030 1.8537 1.0865 1.1039 2.6968 1.0998 5.8831 6.1519 9.3628 1.0609 1.0606 1.0986 1.1019 1.0622 1.0820 1.0917 1.0917 1.1116 1.0953 1.0643
irintensity: 3.2672 0.3941 0.1535 0.1636 1.8053 0.5143 3.3714 1.7148 0.4464 1.4776 4.5188 2.7376 1.9718 2.5581 2.7115 10.0651 19.7838 21.8381 18.3564 53.5242 85.8386 38.1558 9.2159 7.1514 72.6808 13.0571 14.2455 5.0146 3.1442 20.3544 9.2005 9.1679 3.5472 21.2880 14.0743 46.6750 245.4011 20.7574 6.8207 22.3565 23.4844 20.8905 27.4993 20.4806 2.7802 10.4513 24.1409 9.3148 7.8215 53.9240 12.6087 1.2830 2.8154 13.4713 6.5304 30.6377 12.8571 4.2635 16.0675 26.4539 259.7575 2.1068 23.1621 1.1652 17.3385 2.3373 5.5697 21.5280 11.4481 3.5538 0.6365 44.9436
temp: 298.150 k
press: 1.00000 atm
elementType: 35 35 8 8 7 6 6 6 6 6 6 6 6 6 6 1 1 1 1 1 1 1 1 1 1 1
symmnumber: 1
zpe: 506442.5 jmol-1
zpe.correction: 0.192894 hartree
zpe.thermalcorrener: 0.208375 hartree
zpe.thermalcorrenthalpy: 0.209319 hartree
zpe.thermalcorrgfe: 0.144270 hartree
zpe.sumelectzpe: -618.675996 hartree
zpe.sumelectthermal: -618.660515 hartree
zpe.sumelectthermalent: -618.659571 hartree
zpe.sumelectthermalfe: -618.724620 hartree
dipole: -2.2429 -3.5347 -0.5043
dipole: 4.2165
quadrupole: -116.0464 -117.3787 -105.4407
quadrupole: -19.3824 -4.9664 -0.0624
quadrupole: -3.0911 -4.4235 7.5146 -19.3824 -4.9664 -0.0624
hfenergy: -618.8688895 hartree
pointgroup: C01 [X(C10H11Br2N1O2)]
dipole: -0.8486069 -1.4169821 0.1548529 debye
dipolederiv: -0.2617474 -0.0115522 0.033911 -0.1156836 -0.6862078 0.2007292 0.1104072 0.1850177 -0.2199547 -0.1573738 0.0406398 0.0009208 0.0972359 -0.6171349 0.1384581 -0.0227687 0.1721259 -0.185946 -0.8094357 0.4407868 0.0117374 0.5808861 -0.9053041 -0.0468959 0.0162514 -0.0354375 -0.4279961 -0.9104723 -0.3220952 0.1027888 -0.1801125 -0.7985741 0.0560515 0.1106656 0.0889556 -0.323763 -0.1564085 0.0768459 -0.0152529 -0.136889 -0.2817857 0.0186007 0.0054292 -0.0091572 -0.2014618 -0.105535 0.0206221 0.0295246 -0.0496485 -0.0784679 0.0576111 0.3412309 0.097237 0.0043826 -0.1991768 -0.0487265 -0.0298501 -0.156727 0.128734 -0.019055 -0.163459 -0.0044794 0.0564387 0.3606329 0.0496674 -0.0806706 0.2200695 0.7539865 -0.2881619 -0.3456765 -0.2612732 0.2163389 0.5581192 0.0217444 -0.0053726 0.2035143 -0.1125557 -0.0280357 -0.0656369 -0.004752 0.0088094 -0.0238339 -0.049308 0.0374972 -0.1160242 0.7167518 -0.2974851 0.1247333 -0.2243796 0.1615301 -0.1497122 0.0650698 -0.032871 0.1536354 0.1249239 -0.0293436 -0.014098 -0.0276452 -0.1188306 -0.1399097 -0.0907921 -0.0141345 -0.3605724 0.2329043 0.0357399 0.0268009 -0.0148414 -0.0685858 -0.0421777 -0.0709422 0.0086122 -0.0455715 -0.0318194 0.0006879 -0.0001022 0.0086199 -0.0701337 -0.3626018 -0.107727 0.0447921 0.0783032 0.0607398 -0.0146301 0.0610971 0.0185268 0.0454503 1.8866057 0.0255112 -0.2232174 -0.1799041 1.3822234 -0.0559818 -0.2557206 -0.0926371 0.2595362 0.0422844 -0.0801878 0.0264244 -0.0300583 0.0031185 0.1073412 -0.0302089 0.0521639 0.0113192 0.030553 0.0753133 0.0264616 0.0773245 -0.0285672 -0.0921258 -0.0058998 -0.0534932 0.0497133 0.0483731 -0.005996 0.0436836 0.0106597 0.0143248 0.1011683 0.0404305 0.0427824 -0.0040071 0.0334022 0.0280255 0.0306573 0.0845759 -0.0773576 -0.0805769 0.0397137 -0.0382893 0.0370298 -0.0609115 -0.0274519 -0.024494 -0.0480193 -0.0220856 0.0518601 -0.0183753 -0.0031642 -0.0491299 -0.0515175 0.0109675 0.0055711 -0.0321245 -0.0208195 0.0695451 0.0065842 0.0537417 0.0743998 0.1307597 -0.023186 -0.0681669 0.009222 -0.0311646 0.0678792 -0.0654695 0.0017845 -0.0438095 0.0549645 -0.0891809 0.027547 -0.0962283 -0.027924 0.0206748 0.0290656 0.0238189 0.1220869 -0.0103912 0.0973981 0.0195022 0.1216529 -0.0031122 -0.0067486 0.0224384 -0.0006534 0.1137582 0.0935578 0.0562488 0.0045623 0.0780956 0.0285226 -0.0016232 0.006485 0.0023245 0.1603636 0.2019526 -0.0816947 0.0398368 -0.167612 0.276651 0.0343163 0.0460821 0.0231042 0.3924614 unknown
polarizability: 198.8697661|5.6587995|179.8005997|-12.7666826|-27.2125591|88.3329902 unknown
InChI: InChI=1S/C10H11Br2NO2/c11-5-8(12)3-1-7-2-4-9(10(14)15)13-6-7/h2,4,6,8,14H,1,3,5H2
charge 0 multiplicity 1
26 atoms
Br -4.235862 -2.309169 0.561221
Br -4.582605 2.248669 -0.826436
O  4.764871 -0.79717 -0.271673
O  4.716192 1.521291 -0.439425
N  1.890868 1.423056 0.034085
C  -2.357855 -0.365291 -0.653292
C  -1.61426 0.000779 0.659501
C  -3.872773 -0.575756 -0.517482
C  -0.113454 0.0584 0.447183
C  -4.677515 0.493753 0.214057
C  0.68038 -1.115504 0.400549
C  0.556787 1.298828 0.258432
C  2.067706 -1.013166 0.172848
C  2.633723 0.274607 -0.008837
C  4.1030 0.451209 -0.259121
H  -2.20589 0.444977 -1.39458
H  -1.918024 -1.279194 -1.092214
H  -1.858345 -0.755214 1.429839
H  -1.97178 0.981517 1.025365
H  -4.323668 -0.813412 -1.494486
H  -5.748534 0.253641 0.254686
H  -4.28952 0.724718 1.215724
H  0.217766 -2.098276 0.550257
H  -0.00853 2.239189 0.292632
H  2.711372 -1.894552 0.136662
H  5.732147 -0.638329 -0.439492
