program: Gaussian 09
title: 000211527
version: EM64L-G09RevD.01
frameworkgroup: C1[X(C24H28N4O2)]
method: RPBEPBE
basis: SDD
operation: Freq
keyword: #p
keyword: freq=noraman
keyword: PBEPBE/SDD
title: #p freq=noraman PBEPBE/SDD
converged: YES YES NO NO
title: Mulliken charges:
elementType: O O N N N N C C C C C C C C C C C C C C C C C C C C C C C C H H H H H H H H H H H H H H H H H H H H H H H H H H H H
charge: -0.248639 -0.303809 -0.096891 -0.208642 -0.044727 -0.149026 -0.346984 -0.350755 -0.340367 -0.380665 -0.312962 -0.319228 0.130071 0.180613 0.015954 -0.367777 0.364911 0.345332 -0.381963 -0.407894 0.404339 -0.373956 -0.378204 -0.379872 -0.374197 -0.248620 -0.232856 -0.644960 -0.645448 -0.241140 0.221252 0.225594 0.191441 0.211471 0.223407 0.198052 0.249438 0.244505 0.190732 0.211705 0.213729 0.191450 0.227021 0.293699 0.216105 0.237590 0.235347 0.217570 0.269698 0.225101 0.226716 0.238030 0.217498 0.239848 0.237476 0.235332 0.219347 0.229207
chargesum: 0.00000
title: Mulliken charges with hydrogens summed into heavy atoms:
elementType: O O N N N N C C C C C C C C C C C C C C C C C C C C C C C C
charge: -0.248639 -0.303809 -0.096891 -0.208642 -0.044727 -0.149026 0.099862 0.052158 0.081093 0.113278 0.089476 0.085951 0.130071 0.180613 0.015954 -0.140755 0.364911 0.345332 -0.088265 -0.191789 0.404339 -0.136366 -0.142858 -0.162302 -0.104499 -0.023518 -0.006141 0.050415 0.046706 -0.011932
polarizability: 4.69372620e+02 8.73399248e+01 4.34054310e+02 -3.25053121e+01 2.25967140e+01 1.73753653e+02
1716.lowfreq: -9.6730 -0.0008 -0.0007 0.0003 1.2348 3.9167 4.6040 22.6189 24.5722
frequency: -6.7018 22.5974 24.5681 27.7547 28.1064 50.2485 55.5216 72.8724 76.8209 81.6208 87.2150 112.5693 122.4153 144.6411 162.5737 190.3376 198.1524 216.7721 221.0541 230.0257 239.9594 253.7697 283.6239 312.8928 317.2888 337.9689 355.2969 356.9316 389.4519 398.2380 402.3059 407.4751 418.4735 427.6704 455.7473 468.7409 476.1217 491.1932 502.0148 539.3454 554.3303 570.5486 609.3015 615.6543 617.1763 636.2929 646.5775 653.9974 697.6139 725.2722 730.3707 756.1297 758.6491 764.3183 778.8404 792.9680 802.5472 810.9773 827.5978 841.3950 844.6555 850.7918 892.0457 893.9650 913.2845 927.3026 941.6424 945.4170 970.1645 979.8639 988.8983 993.7558 997.4700 999.7580 1002.9926 1025.6336 1027.7545 1042.1239 1053.4215 1056.4753 1072.7529 1076.6886 1084.7220 1093.4375 1107.0897 1109.1719 1111.4662 1134.7707 1136.7551 1142.8635 1168.6632 1172.6972 1188.6308 1191.6901 1195.0003 1220.6602 1238.1475 1241.1737 1259.1419 1260.0397 1271.9954 1288.2401 1296.1293 1309.9045 1314.2698 1318.2844 1324.9653 1334.0603 1337.3715 1349.8495 1357.4024 1366.0360 1371.0845 1372.4516 1380.7167 1386.1333 1389.1232 1419.9025 1430.3029 1437.3317 1443.5850 1449.1456 1449.8166 1451.7274 1460.2158 1462.5263 1465.5395 1471.0613 1477.3690 1479.3351 1488.2182 1492.1044 1506.1152 1530.0201 1544.2281 1555.5515 1579.4404 1589.2064 1613.9353 1632.5228 2867.4363 2877.2646 2905.8609 2944.5099 2952.0729 2953.4572 2957.9770 3011.8763 3015.9078 3027.8394 3036.5872 3044.6810 3057.2237 3078.3301 3082.7618 3099.2952 3108.7875 3123.9314 3127.4973 3131.4004 3132.0969 3144.9198 3157.2182 3158.9376 3163.1880 3166.1037 3170.9689 3184.5823
redmass: 5.6332 4.5121 3.8962 2.9589 3.5194 4.4900 4.8796 4.7849 3.9144 2.9071 4.3589 2.2757 2.8552 3.8025 2.8236 4.3386 1.1693 3.7450 3.6324 2.6661 2.3324 3.1349 4.5244 3.4392 2.8168 3.7927 3.2045 4.8350 3.1596 5.6562 2.9055 2.4387 3.0522 3.8832 5.2584 2.8295 3.6523 3.6986 3.7936 2.9058 4.4716 3.7684 3.4804 4.6265 4.3919 5.2020 4.4387 5.5743 1.7472 5.2275 3.9421 3.3884 4.5578 3.4608 1.9819 2.1590 1.3225 2.6575 1.8121 1.6707 4.5910 1.3405 1.8100 2.1274 4.8512 1.4711 1.8344 2.0029 1.3605 1.3880 5.8453 3.0663 2.7034 1.4516 2.2636 2.4717 2.2233 3.6897 2.0099 1.5041 3.2793 2.7879 1.7013 2.5890 1.2384 2.4560 1.3244 2.6041 2.5627 1.5365 1.6768 1.0562 1.3546 1.1125 1.5532 1.1746 4.5504 1.4481 2.3273 2.7380 1.2861 1.4417 1.3024 1.2844 1.4094 1.5594 1.4080 1.2715 1.9601 1.3218 2.9272 1.4323 1.3212 3.3462 5.7264 4.0956 1.4828 2.4279 1.2724 1.2509 1.0834 2.5487 1.1074 1.0973 1.2310 1.0968 1.0471 3.9285 1.0461 1.1074 2.3862 1.1271 1.1424 2.8462 6.0042 4.9934 7.7188 6.4151 6.0986 6.1332 1.0700 1.0699 1.0684 1.0370 1.0392 1.0663 1.0665 1.0997 1.1023 1.0902 1.0911 1.0896 1.0582 1.0965 1.0977 1.0963 1.0944 1.0847 1.0878 1.1068 1.0881 1.0936 1.0884 1.0965 1.0903 1.0928 1.0988 1.0952
irintensity: 0.0023 0.9068 0.0734 0.1619 0.4541 0.9785 1.1660 0.3892 0.4257 0.3467 1.3902 3.9088 2.7262 0.4861 3.8218 2.1606 0.0725 3.7637 0.3669 0.3558 2.8890 3.9489 0.4169 4.2036 11.2921 3.9741 8.0367 1.5536 4.7361 10.8033 0.5180 0.4828 0.7771 4.2305 1.6032 0.7631 1.9277 3.3436 5.4229 44.2497 21.6324 3.7134 4.1080 9.7567 8.8386 4.6096 7.9505 5.8159 46.8790 1.3762 0.3998 16.8072 0.5863 10.3888 59.3344 5.0669 15.1474 20.8656 73.2365 1.2365 28.5603 4.4226 6.0734 16.2892 33.9245 4.9909 12.9439 20.1253 2.9137 0.7988 1.1984 18.9031 39.8195 1.3055 25.1553 16.6352 8.1171 24.5373 15.6981 25.1153 27.5229 28.6329 11.4472 16.1141 0.3247 3.0261 1.2680 32.2939 100.3482 4.9015 8.4888 0.6369 8.6951 14.0913 10.8894 172.3988 30.6778 37.6910 20.6120 20.1542 4.3459 23.5360 3.0391 19.9940 2.3239 2.4119 16.9300 5.4066 6.0539 12.6665 10.2436 11.4510 22.7653 198.7146 0.6540 28.8485 4.8418 3.0772 2.5395 28.7660 2.1810 4.8062 2.2709 13.6867 40.5428 12.0063 3.1242 16.6131 22.6392 12.6868 90.2213 6.4770 54.5990 422.9337 12.6270 255.5888 166.0763 45.5324 8.9205 461.0087 64.3859 71.2102 70.3948 95.9299 173.7825 35.8411 107.1241 16.2766 65.5787 28.0614 24.5208 28.9603 23.7427 43.3821 35.5532 3.8219 51.0877 5.5636 8.7315 3.2784 5.5259 34.5274 14.7552 21.4299 7.3256 30.2861 18.2723 17.1415
temp: 298.150 k
press: 1.00000 atm
elementType: 8 8 7 7 7 7 6 6 6 6 6 6 6 6 6 6 6 6 6 6 6 6 6 6 6 6 6 6 6 6 1 1 1 1 1 1 1 1 1 1 1 1 1 1 1 1 1 1 1 1 1 1 1 1 1 1 1 1
symmnumber: 1
zpe: 1253589.8 jmol-1
zpe.correction: 0.477467 hartree
zpe.thermalcorrener: 0.504344 hartree
zpe.thermalcorrenthalpy: 0.505289 hartree
zpe.thermalcorrgfe: 0.417908 hartree
zpe.sumelectzpe: -1298.577124 hartree
zpe.sumelectthermal: -1298.550247 hartree
zpe.sumelectthermalent: -1298.549303 hartree
zpe.sumelectthermalfe: -1298.636684 hartree
dipole: -6.3583 1.1993 0.8319
dipole: 6.5236
quadrupole: -138.8124 -168.5509 -179.7159
quadrupole: 27.0824 -8.0527 7.0623
quadrupole: 23.5473 -6.1912 -17.3562 27.0824 -8.0527 7.0623
hfenergy: -1299.0545914 hartree
pointgroup: C01 [X(C24H28N4O2)]
dipole: -2.4554566 0.565476 0.488274 debye
polarizability: 473.1324321|88.648548|423.6208206|-43.5355757|31.018774|180.427331 unknown
InChI: InChI=1S/C24H28N4O2/c1-26(2)21-10-8-19(9-11-21)22-18-23(20-6-4-3-5-7-20)25-28(24(22)29)13-12-27-14-16-30-17-15-27/h3-11,18H,12-17H2,1-2H3
charge 0 multiplicity 1
58 atoms
O  6.246735 -4.079082 -0.009604
O  0.165187 -1.789594 -0.761303
N  4.373925 -1.865184 -0.163008
N  1.278317 0.253909 -0.706163
N  1.421234 1.604032 -0.49755
N  -6.277333 -2.255946 0.449475
C  3.250557 -0.979649 0.212946
C  5.495174 -1.856053 0.810484
C  3.939866 -3.262183 -0.432964
C  2.534592 -0.449165 -1.053876
C  6.662764 -2.692372 0.259598
C  5.124408 -4.082776 -0.965357
C  0.09182 -0.530377 -0.559049
C  -1.113508 0.242009 -0.181344
C  0.303976 2.285393 -0.149979
C  -0.95922 1.623647 -0.009702
C  -2.415816 -0.428765 0.000322
C  0.47453 3.751942 0.055063
C  -2.709442 -1.708262 -0.562642
C  -3.464537 0.196711 0.741304
C  -5.022611 -1.663805 0.306113
C  -3.970652 -2.304959 -0.42364
C  -4.72633 -0.390943 0.896919
C  -0.499339 4.524929 0.743998
C  1.63721 4.409357 -0.434739
C  -0.321276 5.913199 0.928855
C  1.815301 5.794411 -0.247358
C  -6.537584 -3.578295 -0.136492
C  -7.33879 -1.568909 1.197725
C  0.835334 6.556477 0.433057
H  3.645727 -0.117798 0.781889
H  2.505845 -1.499136 0.860997
H  5.187591 -2.271471 1.803197
H  5.831386 -0.813138 0.964184
H  3.122708 -3.260565 -1.17681
H  3.545506 -3.744532 0.496344
H  2.27316 -1.288429 -1.716303
H  3.180882 0.265199 -1.584394
H  7.039513 -2.226597 -0.676917
H  7.481818 -2.767637 0.99417
H  4.850458 -5.143292 -1.091518
H  5.460768 -3.66349 -1.938253
H  -1.84144 2.234721 0.196113
H  -1.922586 -2.234523 -1.107081
H  -3.283516 1.154254 1.243124
H  -4.136044 -3.282569 -0.884899
H  -5.479672 0.1300 1.494398
H  -1.392898 4.04743 1.160384
H  2.389685 3.814351 -0.960414
H  -1.082413 6.490344 1.465806
H  2.715999 6.282981 -0.635784
H  -6.423968 -3.568082 -1.239277
H  -7.569225 -3.885619 0.095638
H  -5.851945 -4.348362 0.270481
H  -7.572583 -0.578403 0.758497
H  -7.062866 -1.41551 2.261063
H  -8.257324 -2.175617 1.170533
H  0.972342 7.634094 0.575846
