program: Gaussian 09
title: 000211525
version: EM64L-G09RevD.01
frameworkgroup: C1[X(C11H13NO3)]
method: RPBEPBE
basis: SDD
operation: Freq
keyword: #p
keyword: freq=noraman
keyword: PBEPBE/SDD
title: #p freq=noraman PBEPBE/SDD
converged: YES YES NO NO
title: Mulliken charges:
elementType: O O O N C C C C C C C C C C C H H H H H H H H H H H H H
charge: -0.364972 -0.211013 -0.185012 -0.445650 0.036836 0.323171 -0.299055 -0.349224 0.203040 -0.231101 -0.246498 -0.226018 -0.685455 0.228567 -0.793524 0.284158 0.246347 0.220794 0.221020 0.237785 0.232277 0.394693 0.223651 0.228563 0.228674 0.229418 0.233933 0.264593
chargesum: 0.00000
title: Mulliken charges with hydrogens summed into heavy atoms:
elementType: O O O N C C C C C C C C C C C
charge: -0.364972 -0.211013 -0.185012 -0.050956 0.036836 0.323171 -0.014897 -0.102877 0.203040 0.210713 -0.008712 0.006259 -0.004567 0.228567 -0.065580
polarizability: 1.86777571e+02 -5.21150946e+00 1.62330384e+02 1.61598796e-01 3.41028150e-01 6.83619976e+01
1716.lowfreq: -50.1960 0.0006 0.0007 0.0008 3.7409 6.4948 9.8040 33.1773 53.0117
frequency: -50.1924 32.9715 53.0076 74.0127 89.8660 98.6947 127.8150 151.5133 160.3116 245.9609 250.0514 263.5707 267.5707 342.9729 370.5691 381.1350 435.7297 505.5245 523.8227 534.2460 577.9599 603.5433 658.9812 683.0016 758.7744 769.5718 776.4793 822.9782 829.7067 851.5446 870.8678 898.3043 911.4877 967.6749 984.0154 1004.9716 1032.7196 1033.6243 1046.0929 1079.7513 1111.7196 1125.0937 1137.3207 1172.4011 1190.7517 1223.9107 1234.2012 1266.7491 1281.8158 1362.9837 1370.6232 1383.3743 1402.5824 1433.0745 1443.8491 1464.3224 1466.3974 1467.4700 1479.9429 1486.2584 1500.7475 1580.6689 1601.5467 1642.2674 1672.0562 2975.4451 2984.6741 2996.7756 3037.6463 3070.5568 3095.4506 3103.1958 3134.7289 3137.3374 3150.9292 3166.2492 3176.8338 3342.6449
redmass: 1.0738 4.7346 5.4528 3.9125 3.8914 2.4056 2.6707 4.0520 4.9829 1.2987 7.9326 3.6042 4.6493 3.4432 7.7328 4.1536 3.5674 6.4605 3.6264 4.5284 2.8811 6.3599 5.9877 3.9565 2.0410 4.6930 1.9603 5.4775 1.1102 1.1349 1.4412 3.8700 3.1864 1.3514 2.4483 1.3384 1.7210 2.8447 2.4294 3.4945 2.2669 1.8760 1.4321 1.3172 2.2439 2.9388 3.0471 1.1375 1.6171 1.5678 1.2356 3.9355 1.2881 2.3425 1.1238 1.0457 1.9473 1.0424 1.1515 1.3056 1.5851 6.3368 5.9398 3.4803 6.2188 1.0558 1.0379 1.0363 1.1082 1.0981 1.0988 1.1020 1.0984 1.0863 1.0901 1.0945 1.0986 1.0808
irintensity: 1.3245 2.5985 1.3047 3.7962 1.6319 0.2276 3.6963 2.7104 0.7196 0.8364 2.2045 0.2470 2.1675 0.5716 3.5430 0.4669 0.9448 18.0973 5.3314 15.3920 0.4837 5.9529 2.5701 12.4686 58.2134 4.2263 32.9320 14.2753 2.5563 86.5770 0.9848 17.7888 21.2670 1.6565 13.2424 0.7959 11.7546 65.3469 25.1196 32.9595 9.8842 33.7723 4.8812 62.2192 80.8863 15.5894 411.6091 0.0060 54.7885 10.5750 47.3598 8.5193 33.2830 26.7782 161.3146 3.1906 130.3275 32.1856 37.5996 162.6435 328.9346 11.5621 106.6113 157.6812 165.6857 38.6924 7.8422 15.5085 21.0675 16.9439 30.1040 35.3272 13.1919 4.1521 3.4993 18.0432 19.5603 245.0469
temp: 298.150 k
press: 1.00000 atm
elementType: 8 8 8 7 6 6 6 6 6 6 6 6 6 6 6 1 1 1 1 1 1 1 1 1 1 1 1 1
symmnumber: 1
zpe: 579865.8 jmol-1
zpe.correction: 0.220859 hartree
zpe.thermalcorrener: 0.235171 hartree
zpe.thermalcorrenthalpy: 0.236116 hartree
zpe.thermalcorrgfe: 0.178492 hartree
zpe.sumelectzpe: -706.297368 hartree
zpe.sumelectthermal: -706.283056 hartree
zpe.sumelectthermalent: -706.282112 hartree
zpe.sumelectthermalfe: -706.339736 hartree
dipole: 4.5735 8.4026 0.0855
dipole: 9.5670
quadrupole: -86.2261 -87.6534 -90.0554
quadrupole: -14.3572 -0.2330 -0.1567
quadrupole: 1.7522 0.3249 -2.0771 -14.3572 -0.2330 -0.1567
hfenergy: -706.5182276 hartree
pointgroup: C01 [X(C11H13N1O3)]
dipole: -1.5526235 3.3959419 0.473598 debye
polarizability: 186.6586435|4.3772769|160.6874288|-8.9500978|9.674572|70.1238804 unknown
InChI: InChI=1S/C11H13NO3/c1-3-15-10-7-5-4-6-9(10)11(14)12-8(2)13/h4-7,12H,3H2,1-2H3
charge 0 multiplicity 1
28 atoms
O  -0.159381 1.423588 0.066019
O  0.732214 -2.71429 -0.454672
O  3.515503 -1.904211 -0.588432
N  1.604611 -0.531358 -0.2994
C  -0.843266 -0.903199 -0.139014
C  -1.202477 0.470287 0.040764
C  -1.891398 -1.859466 -0.163416
C  -2.558983 0.849315 0.186969
C  0.555271 -1.47537 -0.311104
C  -0.486944 2.853991 0.260212
C  -3.242373 -1.492545 -0.019187
C  -3.573476 -0.13061 0.156397
C  0.832066 3.621875 0.253656
C  2.994814 -0.774021 -0.43911
C  3.81182 0.521607 -0.39208
H  -1.593111 -2.904206 -0.301324
H  -2.834076 1.898289 0.323962
H  -1.151192 3.184496 -0.562418
H  -1.018366 2.97242 1.224885
H  -4.026125 -2.255753 -0.043388
H  -4.619084 0.17585 0.270347
H  1.299595 0.44714 -0.172522
H  0.635183 4.699713 0.394794
H  1.491162 3.282821 1.071482
H  1.36083 3.492056 -0.706446
H  3.629369 1.075369 0.547862
H  3.545465 1.1843 -1.236805
H  4.879849 0.269612 -0.459334
