program: Gaussian 09
title: 000216728
version: EM64L-G09RevD.01
frameworkgroup: C1[X(C17H20N2S)]
method: RPBEPBE
basis: SDD
operation: Freq
keyword: #p
keyword: freq=noraman
keyword: PBEPBE/SDD
title: #p freq=noraman PBEPBE/SDD
converged: YES YES NO NO
title: Mulliken charges:
elementType: S N N C C C C C C C C C C C C C C C C C H H H H H H H H H H H H H H H H H H H H
charge: 0.201085 -0.106004 -0.291889 -0.316192 -0.317413 -0.431232 -0.432829 -0.508423 0.468695 -0.384160 -0.393684 -0.173144 -0.246552 -0.235566 -0.176068 -0.183367 -0.292692 -0.237741 -0.214439 -0.240374 0.189277 0.226957 0.213693 0.193486 0.185396 0.211784 0.210381 0.199516 0.196477 0.227937 0.268589 0.243348 0.251743 0.229206 0.231682 0.304304 0.250764 0.224065 0.227025 0.226357
chargesum: 0.00000
title: Mulliken charges with hydrogens summed into heavy atoms:
elementType: S N N C C C C C C C C C C C C C C C C C
charge: 0.201085 -0.106004 -0.023300 0.100042 0.089766 -0.034052 -0.022932 -0.084010 0.468695 -0.384160 -0.150335 0.078599 -0.017346 -0.003883 -0.176068 0.120937 -0.041928 -0.013677 0.012586 -0.014017
polarizability: 2.32486032e+02 1.92830670e+01 2.31295375e+02 -2.05824635e+00 -3.16284674e+00 1.65215097e+02
1716.lowfreq: -12.6346 -3.4701 -0.0010 -0.0006 0.0019 7.6176 27.5057 29.9749 36.4725
frequency: 27.1839 29.6478 36.1732 57.2171 62.0965 65.6918 130.3255 147.1024 180.4656 214.1026 248.9963 260.3209 274.8947 293.7160 320.0231 377.1139 385.8529 393.9492 406.5807 422.1110 429.7511 460.7836 463.3511 491.8591 529.4763 566.4293 602.9383 610.0971 662.3989 671.8580 694.1164 699.4250 728.2841 752.1931 763.1314 780.0087 821.4969 847.6985 857.6868 884.0843 886.7426 910.6570 931.4989 956.4121 970.2283 979.1664 985.5472 991.2069 1002.7246 1009.4955 1013.4927 1023.4558 1043.0611 1055.6539 1063.2205 1069.8988 1077.5611 1093.2481 1113.8155 1118.4802 1133.0413 1165.4818 1169.5416 1172.0367 1189.1041 1197.4700 1204.0082 1210.6885 1257.6032 1267.2712 1289.1026 1299.3268 1315.4175 1320.7999 1330.8382 1355.9687 1373.1531 1375.5889 1385.0212 1388.9535 1423.1631 1426.4774 1444.9675 1451.9355 1456.8624 1459.4447 1461.1249 1464.0305 1468.4786 1472.2821 1573.9519 1584.6756 1588.5378 1597.7624 2855.0475 2864.5146 2870.1177 2874.9102 2888.1598 3036.1512 3037.9012 3041.6145 3044.5742 3047.8257 3084.1352 3115.7355 3122.3414 3132.7442 3133.3407 3147.4628 3148.3053 3162.3640 3164.8441 3458.3384
redmass: 4.8245 3.9446 4.4361 4.5615 3.7730 4.7509 3.6686 4.4405 4.5307 4.3613 4.1141 2.1821 3.4172 3.8087 3.0278 3.7876 3.8370 2.4478 2.9041 3.1901 5.0277 3.2505 2.9498 2.8485 3.0242 2.2090 4.3597 6.4346 6.1435 6.7910 1.7445 2.3894 3.5054 1.4269 1.6296 2.4631 3.8379 1.4777 1.2476 1.5436 2.4289 2.0979 1.3701 1.4090 1.8723 3.0175 1.6810 1.3307 2.7884 1.3691 4.1610 4.6270 2.1869 1.6964 1.8411 1.9957 1.8476 2.2520 2.3538 2.4605 1.7841 3.1313 1.0579 1.0741 1.1319 1.1315 1.1051 2.2346 1.4520 1.3412 1.4168 1.2468 1.3059 1.2487 1.2777 1.4701 5.0060 7.8401 1.3967 1.5156 2.0904 2.1411 1.3522 1.1223 1.6127 1.1301 1.3686 1.6217 1.1897 1.1202 6.1822 6.2906 5.8018 6.5533 1.0709 1.0714 1.0699 1.0702 1.0680 1.0913 1.0902 1.0893 1.0888 1.0874 1.0947 1.0874 1.0858 1.0903 1.0882 1.0948 1.0939 1.1009 1.1005 1.0753
irintensity: 0.5193 0.1280 0.2274 0.3362 0.5840 0.1337 2.4653 0.8222 1.9425 2.6687 0.9898 0.4907 0.5470 1.0221 8.9937 0.1776 1.9610 0.4803 0.6481 6.0425 0.4798 19.3752 1.8918 34.7122 33.7913 35.0218 8.7684 1.3653 6.1072 7.2238 95.4815 28.9248 18.2702 59.1319 52.0605 26.9420 3.7678 0.3191 1.1321 0.3467 4.2922 5.1003 2.6838 2.4225 0.5211 1.4873 1.4234 0.1359 33.3588 4.1006 37.7943 9.4274 1.8468 0.8157 14.9720 3.1551 4.3745 15.2566 14.0539 12.2833 8.7674 20.6288 0.3557 0.6182 1.3316 0.7120 3.5125 6.7557 6.3349 5.8232 7.1027 1.2896 0.1998 35.7893 11.7708 2.2650 0.9254 0.0872 0.5612 1.6228 9.7982 7.7694 3.8457 2.3303 18.9255 4.1877 12.3188 36.8798 16.7674 4.6304 5.4360 4.6593 14.8467 0.2850 59.1345 37.5486 77.7730 47.9892 310.6337 6.3491 69.5399 85.3348 5.6122 12.8399 40.5941 9.0159 0.7097 8.6223 8.6308 25.5138 20.5287 36.3241 26.1193 1.1256
temp: 298.150 k
press: 1.00000 atm
elementType: 16 7 7 6 6 6 6 6 6 6 6 6 6 6 6 6 6 6 6 6 1 1 1 1 1 1 1 1 1 1 1 1 1 1 1 1 1 1 1 1
symmnumber: 1
zpe: 869988.6 jmol-1
zpe.correction: 0.331361 hartree
zpe.thermalcorrener: 0.349388 hartree
zpe.thermalcorrenthalpy: 0.350333 hartree
zpe.thermalcorrgfe: 0.283435 hartree
zpe.sumelectzpe: -1165.876866 hartree
zpe.sumelectthermal: -1165.858839 hartree
zpe.sumelectthermalent: -1165.857895 hartree
zpe.sumelectthermalfe: -1165.924792 hartree
dipole: 0.9888 -0.4063 -1.7929
dipole: 2.0874
quadrupole: -119.8983 -115.4196 -124.7816
quadrupole: 0.6545 -0.0085 -0.8460
quadrupole: 0.1349 4.6136 -4.7484 0.6545 -0.0085 -0.8460
hfenergy: -1166.2082276 hartree
pointgroup: C01 [X(C17H20N2S1)]
dipole: 0.1575488 0.14986 -0.791936 debye
polarizability: 219.3196431|-16.4600956|239.8696655|-2.8325516|-17.0956884|169.8071959 unknown
InChI: InChI=1S/C17H20N2S/c1-2-7-16(8-3-1)20-17-9-5-4-6-15(17)14-19-12-10-18-11-13-19/h1-9,18H,10-14H2
charge 0 multiplicity 1
40 atoms
S  -0.646424 -0.881685 2.151702
N  0.846206 1.837046 0.103546
N  3.182557 2.539685 -1.41326
C  0.729672 2.459248 -1.241519
C  2.109379 2.24469 0.779048
C  1.952109 2.105011 -2.107506
C  3.323866 1.883907 -0.094629
C  -0.344344 2.103305 0.963862
C  -1.565509 1.302401 0.532119
C  -1.776635 -0.046576 0.931841
C  -2.537677 1.903441 -0.310978
C  -2.906526 -0.766853 0.480827
C  -3.663998 1.187566 -0.771786
C  -3.8453 -0.158588 -0.381905
C  0.271575 -2.067419 1.059474
C  0.958555 -1.608251 -0.087587
C  0.315219 -3.429379 1.436655
C  1.680865 -2.53467 -0.873477
C  1.058056 -4.344288 0.652708
C  1.735807 -3.901206 -0.506566
H  0.656137 3.573577 -1.162724
H  -0.188613 2.084468 -1.72808
H  2.173695 1.709737 1.744445
H  2.1288 3.344635 0.979805
H  1.933018 1.003223 -2.304755
H  1.876107 2.628881 -3.077974
H  4.246706 2.24528 0.394659
H  3.380553 0.769971 -0.170901
H  -0.600083 3.192408 0.965504
H  -0.065448 1.821969 1.994308
H  4.023954 2.44861 -1.996182
H  -2.402717 2.952265 -0.603639
H  -3.047785 -1.800046 0.814234
H  -4.395685 1.676882 -1.424214
H  -4.715505 -0.726016 -0.729654
H  0.937329 -0.537092 -0.331112
H  -0.228339 -3.769611 2.324502
H  2.210976 -2.185165 -1.76743
H  1.095503 -5.400211 0.943722
H  2.302347 -4.613544 -1.116988
