program: Gaussian 09
title: 000216719
version: EM64L-G09RevD.01
frameworkgroup: C1[X(C14H30N2O2)]
method: RPBEPBE
basis: SDD
operation: Freq
keyword: #p
keyword: freq=noraman
keyword: PBEPBE/SDD
title: #p freq=noraman PBEPBE/SDD
converged: YES YES NO NO
title: Mulliken charges:
elementType: O O N N C C C C C C C C C C C C C C H H H H H H H H H H H H H H H H H H H H H H H H H H H H H H
charge: -0.242535 -0.208889 -0.088971 -0.121709 -0.340977 -0.347265 -0.326069 -0.450694 -0.440978 -0.399628 -0.583712 -0.549093 0.250557 -0.328700 -0.327288 -0.548051 -0.548306 -0.536026 0.267980 0.264885 0.264938 0.253460 0.293815 0.278381 0.241698 0.273276 0.269630 0.243418 0.220003 0.274696 0.284453 0.269437 0.267222 0.286339 0.288030 0.287130 0.294503 0.262995 0.276583 0.267507 0.280604 0.276741 0.269052 0.277844 0.279300 0.278490 0.273489 0.272432
chargesum: 2.00000
title: Mulliken charges with hydrogens summed into heavy atoms:
elementType: O O N N C C C C C C C C C C C C C C
charge: -0.242535 -0.208889 -0.088971 -0.121709 0.191889 0.171132 0.246127 0.064280 0.072071 0.095071 0.237401 0.025276 0.250557 0.252933 0.212290 0.276801 0.277890 0.288385
polarizability: 2.08320408e+02 -2.14259043e+00 1.44295970e+02 2.03015002e+00 -2.56426367e+00 1.37727723e+02
1716.lowfreq: -16.9409 -5.0857 -0.0014 -0.0005 0.0008 5.5328 13.7642 26.5679 27.6317
frequency: 1.5556 25.0772 27.1062 37.7043 67.4538 76.8881 88.5266 110.9970 145.9783 163.0049 187.5442 189.6810 214.5155 222.7348 257.1546 265.4215 268.9330 280.4111 317.7042 321.7565 337.7245 344.1674 353.4395 395.7894 412.9850 430.8814 442.7622 461.8721 467.1785 481.1859 516.8608 558.5483 574.7486 654.2006 687.8329 732.6128 764.6090 783.5238 799.7408 825.7245 835.7403 856.2062 863.8493 882.5091 891.8129 917.4315 929.3926 931.8932 959.6375 966.8184 974.4631 1006.0430 1043.5677 1046.8591 1052.5810 1055.5974 1061.2518 1075.5327 1111.6573 1112.3321 1117.1965 1120.7886 1139.4148 1154.2484 1175.5944 1182.6115 1203.5337 1204.5914 1215.6940 1235.6491 1250.3841 1263.7814 1280.2721 1283.0290 1292.2845 1311.4366 1322.6078 1324.7068 1340.0264 1348.1331 1353.5401 1356.5189 1362.5394 1373.1873 1395.8438 1407.1732 1424.3738 1424.8336 1431.4395 1445.1561 1447.8206 1453.7628 1453.9348 1458.0267 1458.8449 1462.2988 1464.5164 1464.7993 1467.3681 1470.9423 1477.2359 1482.6279 1484.8501 1487.0030 1488.7212 1499.0552 1499.2906 1652.1170 2997.5222 3006.9873 3010.8322 3012.6767 3015.0908 3018.4591 3026.2411 3028.4644 3030.4473 3032.9075 3034.0802 3035.1484 3044.5651 3062.8020 3064.8698 3071.3122 3082.8655 3091.6471 3097.9429 3104.9251 3107.0164 3131.5675 3141.5285 3145.3343 3146.1376 3147.3013 3151.6525 3151.7421 3154.7944 3163.6663
redmass: 3.3376 3.1506 4.2214 5.8238 3.5762 2.9521 2.3265 2.2830 2.3375 3.3568 1.2218 1.3553 3.1571 4.0894 1.0551 1.1985 1.4198 2.7289 2.7274 2.1111 2.1955 2.4709 2.6194 2.6038 2.1054 2.3154 2.7870 3.0853 2.6352 2.6442 2.9016 3.1027 2.2033 3.8845 3.5741 4.1444 1.6739 1.3793 1.3375 2.6635 2.7039 1.9182 2.6910 3.2992 2.9465 2.7764 1.6817 2.9046 3.7572 2.4565 2.0464 2.2160 1.1964 2.0301 2.3451 2.1273 1.3629 3.1438 1.6069 1.7777 1.8489 1.7443 1.4738 1.8349 1.5584 1.6021 1.4615 1.3847 1.8047 1.4537 1.9376 1.2709 1.1433 1.3200 1.1647 1.4626 1.1689 1.2502 1.3006 1.2626 1.3749 1.4296 1.4072 1.3346 1.2470 1.3481 1.1509 1.1536 1.1519 1.1018 1.0829 1.0595 1.0758 1.1191 1.0704 1.0425 1.0766 1.0651 1.0690 1.0850 1.0776 1.0643 1.0955 1.0527 1.0559 1.0566 1.0605 9.0632 1.0687 1.0626 1.0617 1.0619 1.0599 1.0602 1.0322 1.0325 1.0382 1.0389 1.0556 1.0540 1.0580 1.0998 1.0981 1.0998 1.1000 1.1072 1.1070 1.1075 1.1060 1.1084 1.1050 1.1058 1.1062 1.1055 1.1060 1.1060 1.1055 1.1023
irintensity: 0.2155 0.8191 2.0399 2.6132 3.1113 2.2778 1.7779 0.9277 1.1519 0.1921 0.5204 0.3515 3.2998 7.3772 0.1274 3.0905 0.8357 17.0747 3.1634 0.6920 0.7152 3.4252 1.7460 2.3832 0.1120 0.2678 1.6423 0.0838 1.4012 0.9610 1.2819 4.0970 5.1505 2.0507 7.4386 2.3044 3.6771 14.1437 11.1443 17.0303 5.2467 23.1910 22.4214 46.3725 21.9081 14.9153 13.5193 51.1175 50.9277 0.1645 8.5630 11.3360 0.0159 0.4419 10.9739 5.5092 0.5589 7.4189 1.2177 98.9052 127.9289 121.4305 0.8507 12.1600 7.8872 2.2886 3.9627 0.6057 1.7292 4.1136 0.4696 1.9157 6.6639 2.1572 21.8266 75.6841 0.9181 5.8387 10.1872 12.0968 13.9058 13.4603 0.7721 5.6703 9.0082 17.1051 17.0134 14.9702 27.4946 16.8728 2.7630 2.6451 0.4400 14.1924 2.7914 0.5041 24.3568 0.8322 25.1814 13.8497 1.7748 71.2896 8.4501 47.1428 65.2111 30.3914 76.8666 131.9039 8.7041 12.7222 12.9385 0.5544 4.3315 20.2543 1.2155 1.3332 1.2712 5.5975 2.4441 1.0187 13.7195 5.4799 9.8881 0.6524 13.7195 6.2919 16.1976 0.0801 6.8524 2.0342 3.8651 0.0600 0.5326 1.7866 3.2024 2.4955 5.6092 3.5339
temp: 298.150 k
press: 1.00000 atm
elementType: 8 8 7 7 6 6 6 6 6 6 6 6 6 6 6 6 6 6 1 1 1 1 1 1 1 1 1 1 1 1 1 1 1 1 1 1 1 1 1 1 1 1 1 1 1 1 1 1
symmnumber: 1
zpe: 1145998.8 jmol-1
zpe.correction: 0.436488 hartree
zpe.thermalcorrener: 0.457636 hartree
zpe.thermalcorrenthalpy: 0.458580 hartree
zpe.thermalcorrgfe: 0.382519 hartree
zpe.sumelectzpe: -809.388860 hartree
zpe.sumelectthermal: -809.367712 hartree
zpe.sumelectthermalent: -809.366767 hartree
zpe.sumelectthermalfe: -809.442828 hartree
dipole: 7.9649 0.3167 1.8108
dipole: 8.1743
quadrupole: 119.8486 -94.1507 -95.2087
quadrupole: 1.5748 -2.2009 3.5316
quadrupole: 143.0188 -70.9804 -72.0384 1.5748 -2.2009 3.5316
hfenergy: -809.8253475 hartree
pointgroup: C01 [X(C14H30N2O2)]
dipole: 3.1505868 -0.3289896 0.5553147 debye
polarizability: 208.3867133|-1.6886561|143.7816785|-1.2319124|3.0628448|138.1757089 unknown
InChI: InChI=1S/C14H30N2O2/c1-15(2,3)12-13-18-14(17)8-11-16(4)9-6-5-7-10-16/h5-13H2,1-4H3
charge 2 multiplicity 1
48 atoms
O  1.718925 -1.060665 -0.529751
O  0.946153 1.127937 -0.268157
N  -3.124936 -0.245166 0.423116
N  5.33807 0.152516 0.076155
C  -3.982472 0.937452 0.976584
C  -3.6288 -0.606896 -1.00175
C  -1.668795 0.261921 0.364419
C  -5.494067 0.672407 0.921903
C  -5.140783 -0.883232 -1.054657
C  -5.958719 0.305432 -0.504427
C  -3.230002 -1.445444 1.357186
C  -0.619412 -0.785936 -0.055242
C  0.725137 -0.100404 -0.277667
C  3.874713 -0.27824 0.325042
C  3.048108 -0.539614 -0.952132
C  6.125565 -0.95082 -0.637448
C  5.398676 1.44435 -0.746313
C  5.983552 0.409678 1.445463
H  -3.629928 1.121048 2.006621
H  -3.721401 1.809674 0.350462
H  -3.373475 0.260619 -1.637262
H  -3.049238 -1.482697 -1.338496
H  -1.655072 1.11242 -0.337434
H  -1.435151 0.65663 1.368476
H  -5.790433 -0.109613 1.645468
H  -5.991155 1.599396 1.262002
H  -5.394139 -1.068216 -2.114659
H  -5.392643 -1.816244 -0.516615
H  -5.84335 1.181042 -1.173191
H  -7.032181 0.052915 -0.497704
H  -4.285008 -1.709697 1.501139
H  -2.703162 -2.303952 0.915164
H  -2.783555 -1.182429 2.328958
H  -0.88164 -1.291722 -1.003142
H  -0.4797 -1.581432 0.697703
H  3.913451 -1.195525 0.937127
H  3.404628 0.528302 0.912609
H  2.899885 0.377879 -1.546405
H  3.458912 -1.349003 -1.573544
H  5.725754 -1.100962 -1.650525
H  7.179713 -0.642563 -0.707087
H  6.049143 -1.882434 -0.05621
H  5.047681 1.251087 -1.770322
H  6.442589 1.791165 -0.780584
H  4.767311 2.207397 -0.266201
H  7.033166 0.703963 1.295318
H  5.938081 -0.511789 2.045549
H  5.439601 1.219963 1.954259
