program: Gaussian 09
title: 000211522
version: EM64L-G09RevD.01
frameworkgroup: C1[X(C13H14I3NO3)]
method: RPBEPBE
basis: SDD
operation: Freq
keyword: #p
keyword: freq=noraman
keyword: PBEPBE/SDD
title: #p freq=noraman PBEPBE/SDD
converged: YES YES NO NO
title: Mulliken charges:
elementType: I I I O O O N C C C C C C C C C C C C C H H H H H H H H H H H H H H
charge: 0.148328 0.149213 0.156454 -0.400473 -0.208743 -0.260271 -0.245491 -0.355943 0.813112 0.665875 -0.734378 -0.344812 -0.578557 -0.535332 -0.664015 -0.097927 0.152538 0.194220 -0.662918 -0.764719 0.249057 0.260800 0.226481 0.230479 0.233240 0.255034 0.279589 0.219856 0.258096 0.217495 0.246944 0.248384 0.263965 0.384419
chargesum: 0.00000
title: Mulliken charges with hydrogens summed into heavy atoms:
elementType: I I I O O O N C C C C C C C C C C C C C
charge: 0.148328 0.149213 0.156454 -0.016053 -0.208743 -0.260271 -0.245491 -0.106886 0.813112 0.665875 -0.734378 0.142470 -0.578557 -0.535332 0.054738 0.181662 0.152538 0.194220 0.032529 -0.005427
polarizability: 3.15893829e+02 5.32659411e+00 2.60006070e+02 4.39713431e+00 -2.94313434e+00 1.42747463e+02
1716.lowfreq: -7.1292 -2.4665 -0.0004 0.0003 0.0004 3.3180 24.1621 25.9366 45.6280
frequency: 24.0728 25.9099 45.5994 55.6953 66.1533 80.8955 83.5485 91.1900 92.8374 101.9576 111.0807 117.0715 134.2157 146.8237 156.0623 160.2099 173.6467 184.3492 202.0844 228.5039 248.7277 280.0261 309.0428 309.4778 357.6480 377.8469 398.5732 456.1148 467.9098 475.8236 492.0972 524.3558 549.0910 589.4018 606.4652 621.2695 631.6702 668.2557 695.5204 714.2947 756.4496 763.7737 785.8752 849.1439 881.0508 913.4792 966.3096 991.7747 1007.6805 1010.1117 1029.6064 1034.2415 1079.9618 1091.7927 1106.4728 1117.9657 1150.6226 1221.1512 1235.5102 1258.7927 1267.6861 1278.1570 1289.3223 1299.3350 1342.5437 1360.9424 1366.3999 1381.4368 1387.2527 1395.1382 1405.9523 1445.8468 1449.1996 1466.0930 1468.9864 1469.4426 1479.4140 1483.1930 1504.7336 1532.7293 1607.1098 1657.2001 2965.2359 2991.1313 2994.2685 3003.4845 3015.2153 3074.3652 3081.9372 3086.8398 3102.8460 3111.2786 3113.4027 3129.8668 3185.5605 3516.8754
redmass: 6.3604 6.4800 4.5048 6.6027 4.5273 16.9308 9.8190 11.6269 4.6214 17.4505 1.7516 2.3734 2.3969 4.2630 5.4229 45.8716 1.4586 2.3548 2.7412 3.0035 1.5675 5.1055 5.0069 3.0428 4.7065 4.1477 5.0166 5.0134 4.2850 6.2888 3.5935 3.9717 3.9444 3.1287 3.4026 4.1878 1.8658 6.8707 7.5967 4.3708 6.0020 1.5149 2.8319 2.8943 1.3954 2.5391 3.0177 1.7471 1.9226 5.5995 2.4498 1.6537 2.6871 1.8980 2.3717 2.4533 1.9681 2.2630 3.1159 1.7405 1.5988 2.3536 3.6869 2.6178 1.8070 1.5940 1.7660 1.2683 1.2192 1.2293 3.1377 1.1314 1.0670 1.0450 1.0477 1.0500 1.0630 1.0518 9.1384 8.6857 7.1398 9.1305 1.0787 1.0364 1.0374 1.0354 1.0595 1.1033 1.0979 1.0980 1.1006 1.1002 1.1024 1.0991 1.0930 1.0641
irintensity: 0.1354 0.1111 1.0668 0.1730 0.7821 0.2732 1.6019 0.0958 0.3901 0.1744 0.7578 0.1664 2.5683 1.0177 0.5579 0.0971 0.0937 0.5304 0.2923 1.5084 0.7399 3.6454 1.2221 5.7280 2.1761 0.9161 2.3528 21.6579 3.0680 13.0753 31.1552 18.2806 6.0924 5.8434 33.7235 10.6969 61.2645 7.0751 74.5066 17.3651 4.3172 22.3749 13.2549 1.8498 10.1126 5.6177 8.2413 22.5095 19.6457 36.6895 133.8819 8.0385 10.1279 13.1643 20.9582 71.8165 35.5655 10.0731 38.8865 25.3083 22.0867 183.4637 16.3914 27.6716 36.0256 12.8618 31.2404 53.2643 28.8277 35.3402 184.8085 35.5571 13.1979 9.3677 12.3314 11.3645 9.0053 13.4208 34.4408 8.1808 264.0847 274.3166 33.0004 28.0618 5.5503 18.7484 18.1639 1.7135 6.3104 34.5048 10.7708 10.0037 20.1043 11.1272 0.2406 32.1401
temp: 298.150 k
press: 1.00000 atm
elementType: 53 53 53 8 8 8 7 6 6 6 6 6 6 6 6 6 6 6 6 6 1 1 1 1 1 1 1 1 1 1 1 1 1 1
symmnumber: 1
zpe: 640108.0 jmol-1
zpe.correction: 0.243804 hartree
zpe.thermalcorrener: 0.266974 hartree
zpe.thermalcorrenthalpy: 0.267919 hartree
zpe.thermalcorrgfe: 0.186779 hartree
zpe.sumelectzpe: -817.240793 hartree
zpe.sumelectthermal: -817.217623 hartree
zpe.sumelectthermalent: -817.216679 hartree
zpe.sumelectthermalfe: -817.297819 hartree
dipole: -1.9858 -1.1744 0.8431
dipole: 2.4563
quadrupole: -188.2911 -156.2258 -152.6681
quadrupole: -4.0301 1.4144 1.6787
quadrupole: -22.5628 9.5025 13.0602 -4.0301 1.4144 1.6787
hfenergy: -817.4845977 hartree
pointgroup: C01 [X(C13H14I3N1O3)]
dipole: -0.7748379 0.5094899 -0.2719234 debye
polarizability: 314.9308752|-6.7128059|260.2743877|-10.8224902|5.3581595|143.4420997 unknown
InChI: InChI=1S/C13H14I3NO3/c1-4-17(7(3)18)12-9(15)5-8(14)10(11(12)16)6(2)13(19)20/h5-6,19H,4H2,1-3H3
charge 0 multiplicity 1
34 atoms
I  0.21525 -2.69071 0.011022
I  -3.379194 2.439677 0.575637
I  2.586454 3.008086 0.136302
O  -3.212576 -0.168007 -1.949548
O  -4.96927 -0.805044 -0.568887
O  4.381797 -1.165399 0.611394
N  2.371385 -0.334341 -0.194962
C  -2.640402 -0.932373 0.276283
C  -1.418525 -0.017637 0.208254
C  1.083528 0.256909 0.016813
C  -0.100154 -0.546359 0.072865
C  2.753451 -0.760783 -1.578405
C  -1.503053 1.39902 0.337913
C  0.914134 1.662144 0.154414
C  -3.193362 -1.10482 1.7123
C  -0.364663 2.228174 0.320651
C  -3.747909 -0.603134 -0.729836
C  3.263097 -0.627446 0.857352
C  3.689954 0.224494 -2.302745
C  2.80441 -0.294302 2.271895
H  -2.30692 -1.937722 -0.055145
H  3.254753 -1.739492 -1.480581
H  1.819697 -0.904573 -2.150462
H  -2.42387 -1.566621 2.354979
H  -3.494081 -0.141996 2.156258
H  -4.081105 -1.758749 1.691922
H  -0.470934 3.308915 0.42786
H  3.205145 1.199799 -2.478221
H  4.608374 0.384119 -1.714238
H  3.977197 -0.201407 -3.282282
H  1.801549 -0.704332 2.485937
H  2.768687 0.798352 2.433099
H  3.532447 -0.728566 2.9727
H  -3.952687 -0.023677 -2.599639
