program: Gaussian 09
title: 000216750
version: EM64L-G09RevD.01
frameworkgroup: C1[X(C22H28N2O2)]
method: RPBEPBE
basis: SDD
operation: Freq
keyword: #p
keyword: freq=noraman
keyword: PBEPBE/SDD
title: #p freq=noraman PBEPBE/SDD
converged: YES YES NO NO
title: Mulliken charges:
elementType: O O N N C C C C C C C C C C C C C C C C C C C C C C H H H H H H H H H H H H H H H H H H H H H H H H H H H H
charge: -0.267248 -0.243824 -0.073909 -0.077117 -0.362063 -0.363557 -0.375437 -0.377960 -0.562472 -0.335403 0.346730 -0.512583 0.325492 -0.444650 -0.698610 -0.389896 0.235346 -0.243972 0.481210 -0.259448 -0.395265 -0.392289 -0.248556 -0.241134 -0.253138 -0.505656 0.187024 0.221238 0.197087 0.188169 0.220473 0.198463 0.206443 0.196302 0.200516 0.216465 0.239161 0.189983 0.251179 0.256200 0.238081 0.240135 0.222223 0.246850 0.227204 0.227852 0.250890 0.224308 0.222730 0.224684 0.226868 0.232922 0.241274 0.240679
chargesum: 0.00000
title: Mulliken charges with hydrogens summed into heavy atoms:
elementType: O O N N C C C C C C C C C C C C C C C C C C C C C C
charge: -0.267248 -0.243824 -0.073909 -0.077117 0.046199 0.021700 0.043500 0.024785 -0.145490 0.093742 0.346730 -0.005204 0.325492 -0.206569 -0.236252 -0.143046 0.235346 -0.016768 0.481210 -0.031596 -0.144375 -0.167981 -0.025826 -0.016449 -0.026270 0.209219
polarizability: 2.87636189e+02 -3.06077628e+01 2.27544370e+02 -2.18869101e+01 5.47000613e+00 2.27963901e+02
1716.lowfreq: -17.4171 -3.2718 -0.0004 0.0005 0.0006 5.3278 16.0692 18.0499 22.8819
frequency: 13.5339 16.9074 22.7056 32.8937 36.6210 47.0174 51.4748 63.5554 72.0174 88.8945 104.4309 129.1517 143.4826 170.3833 183.9770 196.2901 210.4808 228.6343 252.1571 258.9160 275.5684 290.1913 314.5213 332.2804 344.5339 382.2971 400.1071 402.8700 429.5725 448.6608 455.8832 475.9447 483.4166 508.1005 559.9885 570.4107 605.9618 614.0312 618.2807 625.0242 666.7159 698.8526 723.2207 733.9480 745.4401 760.8191 782.8051 791.0799 793.6745 803.5840 843.3086 851.9635 854.2262 854.7971 881.6395 892.1558 926.3793 944.8515 951.3176 957.3644 976.6819 986.4183 989.0450 989.3958 992.6774 1001.1226 1020.9080 1027.9682 1045.1507 1047.8726 1057.7618 1076.1960 1081.3529 1092.4839 1104.8975 1112.9219 1124.4238 1130.6364 1132.9108 1145.0467 1148.0759 1165.2946 1169.7471 1172.5955 1182.3215 1189.5707 1190.1618 1192.5985 1199.6855 1205.8914 1223.0768 1236.6817 1260.6297 1275.5548 1279.0686 1293.3730 1301.3583 1306.7395 1309.8976 1332.7903 1334.8256 1341.5655 1359.4474 1372.3158 1378.3150 1383.8228 1390.7501 1398.6192 1422.0515 1436.0193 1438.4135 1441.9033 1447.9085 1452.8953 1454.1869 1456.4616 1462.4152 1464.7610 1466.2165 1474.6022 1479.9686 1483.7548 1487.4253 1587.3843 1591.3956 1610.1726 1614.2657 1645.3238 2836.3905 2848.0182 2857.6390 2861.8011 2874.3639 2895.6620 2960.1549 2975.8809 2995.0474 3003.8195 3017.0526 3029.9046 3040.1968 3041.9069 3047.6530 3049.0407 3074.8910 3104.9638 3110.1867 3111.8533 3116.3413 3120.5048 3133.6111 3136.6278 3144.6792 3148.1689 3158.9560 3159.8524
redmass: 4.0988 5.0646 6.7141 4.3165 3.7130 3.2360 4.2177 3.8972 4.4718 3.3274 1.0638 3.1936 4.1779 3.7444 3.6589 4.0009 4.0458 2.7853 2.7881 3.1303 3.1517 2.5288 3.1492 2.1752 4.0571 2.2926 2.1446 2.5600 3.5246 3.4251 3.0164 4.4423 3.0409 3.8776 4.9988 3.2163 3.5269 3.6771 3.5714 4.9929 3.8836 2.6516 1.7839 2.8240 1.6234 3.3150 2.5694 2.2827 1.6026 3.2453 2.1767 2.4762 1.9879 1.6578 1.4438 1.6397 2.1982 1.8612 1.6141 3.3154 1.3762 1.7188 1.6480 4.1938 1.3128 2.4543 2.6429 2.2660 1.8837 2.1964 1.8782 2.8574 1.6088 2.1441 2.1224 1.2810 2.4860 2.9146 2.7482 2.7377 1.4413 2.4684 1.0645 1.0856 2.6250 1.2149 1.1817 1.1841 1.1923 1.8297 1.7890 1.4698 1.3646 1.7174 1.4393 1.3261 1.3529 1.3354 1.4886 1.3301 1.2869 1.3532 1.4235 1.4959 3.7793 4.5690 1.7894 1.4903 1.1931 2.1396 2.2578 1.0818 1.1230 1.0501 1.0836 1.0830 1.1079 1.0510 1.1083 1.1381 1.0994 2.2157 2.3207 6.5983 6.0600 6.1308 6.1813 8.9113 1.0711 1.0709 1.0702 1.0704 1.0693 1.0682 1.0670 1.0858 1.0633 1.0298 1.0897 1.0889 1.0902 1.0889 1.0876 1.0912 1.0957 1.1045 1.0866 1.0864 1.0892 1.0861 1.0920 1.0926 1.0949 1.1047 1.1006 1.1012
irintensity: 0.1219 0.1402 1.5825 0.1983 0.0741 0.0256 0.0262 0.0501 0.1623 0.1965 0.1938 3.4471 0.4568 0.9892 10.5996 3.0164 1.9880 0.2502 0.5862 4.9407 2.7903 6.8425 13.1230 13.8196 3.7883 1.4573 0.1649 0.0079 4.9627 3.7310 3.2665 2.4239 0.3490 2.2669 4.3817 2.7129 7.9322 0.1043 1.2741 3.5663 7.4318 17.1178 60.7434 15.4212 53.8148 9.4367 26.3216 15.7953 16.6549 6.9715 5.3484 5.9704 7.7591 0.4216 2.4865 0.2919 5.8179 4.2838 0.0239 25.9809 0.4432 8.1497 2.8261 0.5197 0.5121 81.5031 3.5910 9.1195 11.0542 8.5968 1.8826 27.1513 8.7587 1.2291 4.1519 4.6536 62.2125 186.0805 32.1446 49.0707 5.9527 41.3011 0.0685 0.0902 0.4324 1.0388 1.5971 0.5405 1.3425 4.9301 7.6924 11.4860 21.3536 0.2288 16.0052 25.1479 7.6254 8.7076 36.7245 10.7031 10.1782 22.6028 29.2621 13.4117 1.7642 1.6890 3.3624 8.8054 26.9484 9.1011 6.7651 15.3828 20.7386 13.7723 0.5548 0.0275 13.2933 10.3022 7.4728 14.1533 15.9374 20.4213 19.8214 0.9777 0.9473 14.1708 5.0874 158.0710 56.1059 60.8733 106.0046 42.6905 131.6926 114.9091 32.3446 19.3993 12.7242 35.0871 42.6432 52.4437 22.9339 37.0543 12.1806 16.9589 18.8416 27.5543 7.9462 14.5011 3.3312 0.1177 21.4613 27.1045 27.9343 16.8403 42.2522 18.0006
temp: 298.150 k
press: 1.00000 atm
elementType: 8 8 7 7 6 6 6 6 6 6 6 6 6 6 6 6 6 6 6 6 6 6 6 6 6 6 1 1 1 1 1 1 1 1 1 1 1 1 1 1 1 1 1 1 1 1 1 1 1 1 1 1 1 1
symmnumber: 1
zpe: 1192812.3 jmol-1
zpe.correction: 0.454318 hartree
zpe.thermalcorrener: 0.479498 hartree
zpe.thermalcorrenthalpy: 0.480442 hartree
zpe.thermalcorrgfe: 0.394883 hartree
zpe.sumelectzpe: -1113.128827 hartree
zpe.sumelectthermal: -1113.103647 hartree
zpe.sumelectthermalent: -1113.102703 hartree
zpe.sumelectthermalfe: -1113.188262 hartree
dipole: 0.3562 -0.3980 -1.1287
dipole: 1.2487
quadrupole: -147.7885 -152.7039 -147.8310
quadrupole: -4.4688 9.4275 -0.3222
quadrupole: 1.6526 -3.2628 1.6101 -4.4688 9.4275 -0.3222
hfenergy: -1113.583145 hartree
pointgroup: C01 [X(C22H28N2O2)]
dipole: 0.0930307 -0.3385856 -0.3435756 debye
polarizability: 275.2766385|-43.630506|244.132741|-6.5670383|4.5409402|223.7350804 unknown
InChI: InChI=1S/C22H28N2O2/c1-26-22(25)11-12-23-13-15-24(16-14-23)18-21-10-6-5-9-20(21)17-19-7-3-2-4-8-19/h2-10H,11-18H2,1H3
charge 0 multiplicity 1
54 atoms
O  -6.343344 0.015488 -1.355058
O  -6.132847 1.116993 0.685208
N  0.712525 -1.010596 1.403251
N  -2.11411 -0.429354 1.07258
C  -0.045988 -1.540242 0.245762
C  -0.180086 -0.836811 2.573332
C  -1.21692 -0.608146 -0.101602
C  -1.33841 0.10865 2.220211
C  1.921326 -1.803385 1.728451
C  -3.298062 0.410622 0.774618
C  2.979757 -1.809847 0.62838
C  -4.287891 -0.309697 -0.162028
C  3.612266 -0.61488 0.166481
C  3.390481 -3.057543 0.093301
C  3.232591 0.768402 0.6779
C  4.642698 -0.723224 -0.803721
C  -5.647014 0.365849 -0.191558
C  4.410232 -3.149492 -0.879168
C  2.249115 1.563136 -0.194527
C  5.045333 -1.970684 -1.328208
C  2.008519 1.260486 -1.557146
C  1.574329 2.674656 0.375874
C  1.119651 2.046595 -2.328491
C  0.689033 3.463793 -0.389727
C  0.456652 3.152448 -1.750761
C  -7.716847 0.563938 -1.469988
H  -0.446423 -2.564696 0.459776
H  0.633241 -1.610917 -0.622075
H  0.404866 -0.405592 3.408506
H  -0.605497 -1.814453 2.917275
H  -0.807457 0.371774 -0.449584
H  -1.791161 -1.056987 -0.932053
H  -2.015515 0.203941 3.089643
H  -0.91571 1.119265 1.990749
H  1.662724 -2.866103 1.973958
H  2.351897 -1.366163 2.653241
H  -3.818764 0.626037 1.725075
H  -3.010697 1.397724 0.330927
H  -3.916606 -0.39281 -1.197495
H  -4.426273 -1.344699 0.21038
H  2.901022 -3.971549 0.452207
H  2.793571 0.69516 1.687952
H  4.160017 1.371214 0.775877
H  5.142064 0.192748 -1.144361
H  4.708289 -4.126707 -1.275016
H  5.846372 -2.021083 -2.074203
H  2.509599 0.402645 -2.018346
H  1.741486 2.918921 1.432892
H  0.947174 1.793484 -3.381241
H  0.179198 4.316908 0.072959
H  -0.230262 3.762068 -2.348685
H  -8.094321 0.176366 -2.426559
H  -7.689811 1.666591 -1.469479
H  -8.339012 0.218752 -0.626982
