program: Gaussian 09
title: 000216740
version: EM64L-G09RevD.01
frameworkgroup: C1[X(C22H30N2)]
method: RPBEPBE
basis: SDD
operation: Freq
keyword: #pfreq=noraman
keyword: PBEPBE/SDD
title: #p freq=noraman PBEPBE/SDD
converged: YES YES NO NO
title: Mulliken charges:
elementType: N N C C C C C C C C C C C C C C C C C C C C C C H H H H H H H H H H H H H H H H H H H H H H H H H H H H H H
charge: -0.070435 -0.086225 -0.371261 -0.374949 -0.371906 -0.365511 -0.327157 -0.559604 -0.376149 0.314447 -0.346628 0.308642 -0.423534 -0.711759 -0.693437 -0.368830 -0.256930 -0.245180 0.513075 -0.465918 -0.374816 -0.225711 -0.232328 -0.250802 0.208024 0.180085 0.186943 0.204420 0.190323 0.225858 0.200977 0.190049 0.199084 0.171185 0.203109 0.220607 0.195048 0.207039 0.193399 0.192716 0.235806 0.220069 0.263516 0.215965 0.209039 0.211674 0.243342 0.225412 0.225006 0.231258 0.244624 0.222206 0.221136 0.224988
chargesum: 0.00000
title: Mulliken charges with hydrogens summed into heavy atoms:
elementType: N N C C C C C C C C C C C C C C C C C C C C C C
charge: -0.070435 -0.086225 0.016848 0.016414 0.044275 0.025514 0.043111 -0.135888 0.025938 0.314447 0.039488 0.308642 -0.187728 -0.228175 -0.056760 -0.125488 -0.031517 -0.020174 0.513075 -0.234660 -0.130192 -0.003506 -0.011192 -0.025814
polarizability: 2.70598928e+02 8.46949990e+00 2.64113232e+02 -3.98568593e+00 4.07041391e+00 2.04939726e+02
1716.lowfreq: -27.8466 -15.7722 -10.5741 -0.0007 -0.0004 -0.0002 5.0304 12.9723 22.0625
frequency: -27.7345 12.0885 21.1731 31.2555 37.9481 54.7163 57.8375 69.1563 80.2511 110.2536 132.0521 150.1414 198.5459 203.7114 215.7046 227.8471 240.7255 262.2274 265.3404 281.6691 315.8165 332.1457 336.1385 394.9965 399.1759 403.9481 433.7907 448.7035 461.6194 479.0650 483.8108 520.5277 559.7042 604.5392 617.6028 617.8686 623.1584 703.1254 728.8052 734.2984 737.8339 750.8522 766.1811 789.2433 793.1593 798.1268 819.6678 844.8212 848.7632 852.8874 879.8561 896.9775 915.2986 923.1881 939.1961 943.0081 960.0312 974.8841 984.4985 989.9958 991.0612 992.3909 997.2511 1008.6278 1026.1024 1040.3983 1047.3047 1057.1014 1074.9802 1080.1950 1087.4402 1100.6939 1106.0017 1114.2554 1130.1584 1140.5685 1145.7843 1169.8269 1172.5260 1178.3948 1183.5171 1185.0780 1195.4211 1197.0708 1208.6919 1217.9185 1230.7647 1238.6046 1260.4660 1273.1140 1276.7786 1286.2891 1289.1765 1294.9692 1304.6872 1319.7234 1329.7063 1333.2944 1336.7261 1345.4794 1360.3282 1369.1394 1379.1886 1385.0945 1387.3880 1388.9823 1395.1340 1437.1728 1439.6729 1452.8385 1453.8894 1455.4761 1459.7400 1465.8671 1468.1025 1471.8280 1476.5848 1479.8292 1480.6236 1482.8173 1486.7227 1489.1460 1585.7882 1593.0787 1611.2448 1614.2861 2825.9922 2835.9448 2853.2891 2858.0039 2862.2778 2875.8217 2963.9692 2972.9245 2976.9978 2977.6196 2995.9749 2998.7884 3007.5761 3019.3382 3027.3469 3042.6046 3044.3659 3050.7010 3051.3423 3070.3457 3072.0116 3111.5504 3111.8001 3117.9264 3121.8529 3131.3056 3137.4637 3141.0108 3158.1041 3159.1304
redmass: 3.9743 4.5409 3.2934 2.9821 3.5385 1.9279 3.5427 4.2791 3.2733 2.9644 2.6602 3.6439 3.1639 3.1388 3.5422 1.2224 3.8743 1.9558 2.9165 3.4420 2.5627 2.2999 2.5792 2.5860 1.9715 2.7377 3.1493 2.9399 3.5700 3.7736 2.8910 3.8903 5.2020 4.0599 5.2862 2.7967 3.4088 1.8872 3.0132 2.4619 1.0819 1.5951 2.8689 3.1096 2.2349 1.2637 3.0812 2.7843 1.7996 1.2505 1.3657 1.7695 1.5877 1.6399 1.7395 1.4300 1.5016 1.3914 2.1043 2.6417 1.8458 1.3329 2.3279 2.8592 2.2141 2.7575 2.1757 1.7352 1.7470 2.2721 2.0518 2.0272 2.2845 2.4002 2.5669 2.8196 2.4998 1.0578 1.0916 1.7569 1.9620 1.1240 1.1156 1.2536 2.5162 1.3713 1.7053 1.7654 1.3596 1.4133 1.3218 1.2666 1.2549 1.2706 1.3282 1.3742 1.3083 1.3058 1.3067 1.4795 1.4191 1.4907 6.0007 2.9759 1.3497 1.6549 1.4682 2.1592 2.0617 1.0818 1.1586 1.0850 1.0921 1.1003 1.0814 1.0820 1.0428 1.1805 1.3682 2.2375 1.4955 1.0916 6.6173 6.0722 6.2257 6.2329 1.0709 1.0706 1.0706 1.0708 1.0702 1.0679 1.0584 1.0376 1.0600 1.0637 1.0869 1.0854 1.0996 1.0905 1.0879 1.0942 1.0969 1.0953 1.0889 1.1008 1.0994 1.0868 1.0865 1.0862 1.0876 1.0915 1.0933 1.0962 1.1006 1.1015
irintensity: 0.0150 0.0250 0.0029 0.0634 0.0166 0.0329 0.2762 0.1349 0.3844 0.3057 1.2243 1.0340 1.8496 0.4908 1.7079 0.1764 1.0850 1.0726 0.8390 0.8944 3.4209 4.9083 10.1403 1.0156 0.8314 0.4357 4.6728 0.7955 8.3295 2.8216 0.5736 3.3450 5.0565 2.4532 1.1080 1.7946 8.0462 41.2203 13.3064 24.6148 10.5328 58.9358 14.2268 7.5738 39.9542 6.8747 6.1240 1.4029 0.1795 0.4973 2.8161 12.5282 3.0168 5.0756 3.3606 0.1903 5.2389 0.1120 10.8441 0.4149 0.0456 0.7655 42.6796 12.7611 7.5552 2.9068 10.1641 0.2027 8.9507 1.6765 5.1340 6.4855 13.8583 20.6121 18.6888 30.4271 38.7494 0.2866 0.3083 3.9534 3.5704 0.5377 0.2381 3.3338 2.6407 0.1480 0.2933 4.1194 9.9647 10.8704 2.2979 3.9555 7.0597 9.2288 6.5772 8.3839 6.8683 18.8310 10.3771 2.2361 15.0443 5.6381 0.5582 0.4438 7.0447 4.7456 1.0354 8.2737 3.7875 2.0773 16.8751 1.5253 10.1290 7.3952 0.9674 1.9874 11.8981 3.6454 6.7284 15.8474 31.8414 14.8335 3.1734 0.3637 9.8276 2.9588 51.2497 78.7119 61.4082 48.1623 16.6313 335.9588 22.3509 32.2171 40.5869 29.3325 20.0211 31.3373 1.8107 41.6241 62.8341 69.0764 4.8896 9.5815 32.5666 93.5574 54.2926 13.5546 6.1804 0.5257 2.8438 14.9675 25.6355 47.1296 37.5731 26.0670
temp: 298.150 k
press: 1.00000 atm
elementType: 7 7 6 6 6 6 6 6 6 6 6 6 6 6 6 6 6 6 6 6 6 6 6 6 1 1 1 1 1 1 1 1 1 1 1 1 1 1 1 1 1 1 1 1 1 1 1 1 1 1 1 1 1 1
symmnumber: 1
zpe: 1231387.0 jmol-1
zpe.correction: 0.469011 hartree
zpe.thermalcorrener: 0.491585 hartree
zpe.thermalcorrenthalpy: 0.492529 hartree
zpe.thermalcorrgfe: 0.414161 hartree
zpe.sumelectzpe: -964.016612 hartree
zpe.sumelectthermal: -963.994038 hartree
zpe.sumelectthermalent: -963.993093 hartree
zpe.sumelectthermalfe: -964.071462 hartree
dipole: -0.8146 -0.1536 0.3578
dipole: 0.9028
quadrupole: -142.4135 -141.4525 -141.0739
quadrupole: -0.1870 0.4262 -0.8174
quadrupole: -0.7669 0.1941 0.5727 -0.1870 0.4262 -0.8174
hfenergy: -964.4856228 hartree
pointgroup: C01 [X(C22H30N2)]
dipole: -0.3019876 -0.0246211 0.1853759 debye
polarizability: 267.9529417|5.2570022|259.9029988|-11.7851256|-18.0183581|211.7959452 unknown
InChI: InChI=1S/C22H30N2/c1-2-3-13-23-14-16-24(17-15-23)19-22-12-8-7-11-21(22)18-20-9-5-4-6-10-20/h4-12H,2-3,13-19H2,1H3
charge 0 multiplicity 1
54 atoms
N  -3.020879 -0.42712 1.086582
N  -0.177671 -0.967945 1.363022
C  -2.177106 -0.743922 -0.09192
C  -2.200236 0.237359 2.130896
C  -0.988297 -1.630522 0.310951
C  -1.02155 -0.657517 2.543386
C  -4.228578 0.36741 0.747114
C  1.04221 -1.736724 1.73052
C  -5.265675 -0.408338 -0.090808
C  2.053849 -1.839238 0.592542
C  -6.579721 0.385506 -0.274452
C  2.731478 -0.693735 0.076258
C  2.337088 -3.115451 0.042833
C  2.512354 0.708628 0.657731
C  -7.614994 -0.366586 -1.138483
C  3.664349 -0.869662 -0.977716
C  3.273859 -3.279711 -1.000686
C  3.941196 -2.145283 -1.514559
C  2.342766 1.804022 -0.391064
C  3.27715 2.862385 -0.51179
C  1.221012 1.788048 -1.261873
C  3.101738 3.880062 -1.479344
C  1.042265 2.800073 -2.228752
C  1.983509 3.851707 -2.34258
H  -2.784269 -1.28157 -0.840994
H  -1.78653 0.191969 -0.571927
H  -1.793984 1.218266 1.772752
H  -2.840196 0.432129 3.012066
H  -1.380108 -2.617029 0.667582
H  -0.347033 -1.815868 -0.569225
H  -0.402621 -0.129075 3.293693
H  -1.423331 -1.588118 3.018118
H  -4.703423 0.665104 1.703318
H  -3.957491 1.317074 0.212754
H  0.782249 -2.769732 2.074666
H  1.496935 -1.220561 2.599389
H  -4.854861 -0.649683 -1.091548
H  -5.47379 -1.373068 0.412046
H  -7.017601 0.603306 0.721186
H  -6.354938 1.36814 -0.737883
H  1.810426 -3.99124 0.442862
H  3.374652 0.963219 1.306575
H  1.608314 0.687335 1.290403
H  -8.549738 0.213593 -1.247301
H  -7.218257 -0.561637 -2.152809
H  -7.872898 -1.34294 -0.686695
H  4.172447 0.012878 -1.384442
H  3.476295 -4.27623 -1.40884
H  4.668351 -2.252637 -2.327556
H  4.146608 2.891231 0.157443
H  0.49062 0.975154 -1.171127
H  3.834979 4.691146 -1.55793
H  0.169875 2.773683 -2.892346
H  1.845295 4.638212 -3.093239
