program: Gaussian 09
title: 000216717
version: EM64L-G09RevD.01
frameworkgroup: C1[X(C13H28N2O2)]
method: RPBEPBE
basis: SDD
operation: Freq
keyword: #p
keyword: freq=noraman
keyword: PBEPBE/SDD
title: #p freq=noraman PBEPBE/SDD
converged: YES YES NO NO
title: Mulliken charges:
elementType: O O N N C C C C C C C C C C C C C H H H H H H H H H H H H H H H H H H H H H H H H H H H H
charge: -0.242716 -0.209533 -0.098881 -0.121831 -0.381346 -0.374410 -0.467757 -0.459715 -0.354237 -0.569415 -0.537336 0.253589 -0.328113 -0.327926 -0.546822 -0.549289 -0.536190 0.278217 0.286277 0.294494 0.281875 0.281657 0.280808 0.283008 0.280061 0.297372 0.282332 0.270580 0.291715 0.269622 0.288645 0.287065 0.295022 0.287030 0.263950 0.276239 0.276639 0.266629 0.280828 0.269487 0.279542 0.278042 0.278524 0.273537 0.272729
chargesum: 2.00000
title: Mulliken charges with hydrogens summed into heavy atoms:
elementType: O O N N C C C C C C C C C C C C C
charge: -0.242716 -0.209533 -0.098881 -0.121831 0.183149 0.201959 0.094708 0.103354 0.225467 0.262502 0.038375 0.253589 0.253939 0.212263 0.277275 0.277782 0.288600
polarizability: 1.93756464e+02 -2.40283683e+00 1.34413401e+02 1.13089807e+00 -1.62243973e+00 1.28091980e+02
1716.lowfreq: -21.5118 -16.0172 -5.8095 -0.0012 -0.0008 0.0005 6.6974 16.8769 25.6802
frequency: -18.8572 15.5967 25.5411 42.8067 67.7511 81.0434 88.0752 91.4956 118.7980 163.2662 174.4746 180.8466 215.6064 227.1217 249.9121 254.3268 259.4110 280.0031 329.5315 339.6159 350.3422 355.4492 395.5931 417.2225 431.0584 444.1277 469.1901 514.4916 563.4038 598.8091 636.7074 672.1013 714.3731 732.3265 783.4091 800.8790 803.4449 810.8058 845.7349 883.1723 893.3931 903.4293 909.9753 916.7282 932.1898 956.6553 961.0884 999.9618 1004.5598 1043.9468 1051.7993 1058.1001 1061.1473 1071.2383 1082.6207 1085.8237 1113.1237 1120.8717 1139.3230 1157.6566 1170.3021 1202.3006 1205.8375 1215.7475 1227.7441 1230.9779 1241.6845 1251.7852 1256.9071 1282.4044 1296.5982 1307.7688 1318.5498 1320.5155 1329.7758 1341.7474 1346.4308 1354.8624 1395.0528 1400.4523 1424.2995 1425.7977 1435.2487 1446.2267 1447.2623 1453.9887 1458.2960 1462.0500 1463.0293 1464.1487 1470.1790 1474.3945 1477.6453 1478.8586 1487.2235 1489.3920 1490.9696 1495.8014 1499.7912 1505.5898 1652.0471 3008.0754 3026.1600 3029.3599 3030.5711 3030.7433 3032.6527 3034.4006 3034.8512 3039.6994 3043.0495 3044.3493 3052.5501 3072.1433 3094.8688 3104.0242 3105.5506 3109.4724 3117.3766 3127.5325 3131.0519 3145.1614 3145.3763 3145.9133 3146.7750 3151.6607 3152.6445 3153.6812 3155.8856
redmass: 2.6689 4.0617 3.7563 6.1171 3.6910 2.4777 2.4671 1.6763 2.1970 2.6455 1.8615 1.6062 2.1740 4.1683 1.1747 1.1391 1.0777 3.6929 2.5200 2.2546 2.8580 2.6574 2.8030 2.2405 2.3248 2.7856 3.0087 3.1038 3.3149 3.9822 3.4886 3.4690 2.3053 4.0482 1.5119 1.4742 1.4232 1.5500 4.2721 3.2886 2.6209 2.8727 2.3239 2.7676 3.1460 2.1675 4.5131 1.9212 2.4697 1.1981 2.3036 1.5051 1.5652 2.5467 1.6733 3.1217 1.6008 3.2198 1.4715 1.6359 1.4196 1.5103 1.2143 1.7968 1.2318 1.3981 1.2547 1.9328 1.3427 1.3327 1.2425 1.2296 1.3538 1.1685 1.3181 1.3656 1.3159 1.3274 1.2522 1.3675 1.1506 1.1501 1.1489 1.0956 1.0826 1.0500 1.1138 1.0536 1.0717 1.0567 1.0778 1.0595 1.0841 1.0653 1.0521 1.0551 1.0739 1.0662 1.0612 1.0888 9.1378 1.0631 1.0323 1.0328 1.0349 1.0426 1.0589 1.0590 1.0495 1.0596 1.0619 1.0578 1.0651 1.0990 1.1046 1.1077 1.1063 1.1060 1.1080 1.1078 1.1086 1.1054 1.1060 1.1061 1.1055 1.1057 1.1061 1.1042 1.1055
irintensity: 0.1693 2.0062 1.4295 2.8845 3.6123 1.7191 1.5375 0.1316 0.5674 0.1607 2.2326 0.7226 1.8007 8.1516 0.6486 0.6445 0.4047 23.0864 1.4127 0.1196 1.7016 1.7830 2.8294 0.0763 0.2345 1.4961 0.5367 1.3057 5.3948 6.1888 0.2529 4.4284 8.2262 1.8456 13.5105 1.0868 9.1402 15.4282 6.1088 47.0673 4.3385 42.8528 2.9909 14.4954 46.4048 13.8304 52.2307 7.4297 11.2743 0.0196 5.6517 1.9662 7.0745 5.7044 0.9891 15.0357 47.0329 283.4325 1.8237 0.4451 6.7755 3.5893 2.0554 1.6603 0.6408 1.9567 12.3309 0.5724 4.0994 3.5712 30.2239 24.6563 41.2830 2.8018 6.6791 5.5718 30.4642 10.0849 6.4481 20.4449 15.9507 16.0274 33.9534 10.3225 8.9388 1.5084 14.6605 1.3973 1.5658 0.1682 2.1666 3.7864 1.9467 44.5654 46.7431 72.0357 39.0593 17.8371 84.2512 9.8098 132.1324 1.2142 1.0825 1.4220 2.7530 1.7082 1.1329 10.7661 0.3492 11.2353 7.2562 13.6385 2.9281 0.2509 0.5720 0.1030 1.9134 1.3514 1.3462 10.8276 1.9937 3.2529 0.0270 0.4295 2.1239 4.1436 1.2083 3.8140 5.7203
temp: 298.150 k
press: 1.00000 atm
elementType: 8 8 7 7 6 6 6 6 6 6 6 6 6 6 6 6 6 1 1 1 1 1 1 1 1 1 1 1 1 1 1 1 1 1 1 1 1 1 1 1 1 1 1 1 1
symmnumber: 1
zpe: 1070997.3 jmol-1
zpe.correction: 0.407921 hartree
zpe.thermalcorrener: 0.427346 hartree
zpe.thermalcorrenthalpy: 0.428290 hartree
zpe.thermalcorrgfe: 0.358568 hartree
zpe.sumelectzpe: -770.161017 hartree
zpe.sumelectthermal: -770.141592 hartree
zpe.sumelectthermalent: -770.140648 hartree
zpe.sumelectthermalfe: -770.210370 hartree
dipole: 5.1328 -0.1350 1.7178
dipole: 5.4143
quadrupole: 116.5190 -90.3038 -87.0181
quadrupole: 1.8460 -1.6332 2.7636
quadrupole: 136.7866 -70.0362 -66.7504 1.8460 -1.6332 2.7636
hfenergy: -770.5689382 hartree
pointgroup: C01 [X(C13H28N2O2)]
dipole: 2.0213247 0.2055649 -0.6398943 debye
polarizability: 193.70112|3.198413|134.8547189|-0.2279855|-0.2720065|127.706006 unknown
InChI: InChI=1S/C13H28N2O2/c1-14(2,3)11-12-17-13(16)7-10-15(4)8-5-6-9-15/h5-12H2,1-4H3
charge 2 multiplicity 1
45 atoms
O  1.360579 1.189403 0.131066
O  0.647395 -0.984109 0.600614
N  -3.451348 0.004991 -0.387311
N  5.01297 -0.052758 -0.108706
C  -3.961708 0.642004 0.931154
C  -4.368376 -1.244871 -0.524305
C  -5.493671 0.440275 0.911505
C  -5.755626 -0.790918 -0.020515
C  -1.982592 -0.43336 -0.316181
C  -3.694629 0.946472 -1.56393
C  -0.977838 0.726239 -0.166068
C  0.391618 0.177647 0.222793
C  3.53153 0.218699 -0.455295
C  2.707292 0.865141 0.678659
C  5.76734 1.255058 0.152794
C  5.13211 -0.970024 1.113054
C  5.650236 -0.754359 -1.316753
H  -3.484141 0.082742 1.753744
H  -3.650504 1.697093 0.975521
H  -4.347816 -1.587678 -1.570867
H  -3.930669 -2.025518 0.120245
H  -5.859997 0.262695 1.934817
H  -6.011638 1.337985 0.537694
H  -6.421898 -0.522299 -0.855716
H  -6.242127 -1.615919 0.523067
H  -1.892541 -1.123362 0.539744
H  -1.778086 -1.010699 -1.2345
H  -3.15965 1.892871 -1.398742
H  -4.771713 1.149742 -1.645153
H  -3.339807 0.46539 -2.488516
H  -0.867689 1.324575 -1.086779
H  -1.279209 1.429089 0.634469
H  3.087824 -0.75367 -0.727875
H  3.528015 0.877857 -1.340118
H  2.587092 0.189573 1.542483
H  3.099991 1.84279 0.995386
H  5.651932 1.918655 -0.717759
H  5.371368 1.740501 1.056161
H  6.832476 1.023255 0.303968
H  4.787899 -0.438662 2.012119
H  4.522795 -1.87159 0.948009
H  6.188378 -1.251474 1.240111
H  6.712836 -0.941465 -1.1004
H  5.559602 -0.105864 -2.201473
H  5.133094 -1.709645 -1.493922
