program: Gaussian 09
title: 000211519
version: EM64L-G09RevD.01
frameworkgroup: C1[X(C13H17NO4S)]
method: RPBEPBE
basis: SDD
operation: Freq
keyword: #p
keyword: freq=noraman
keyword: PBEPBE/SDD
title: #p freq=noraman PBEPBE/SDD
converged: YES YES NO NO
title: Mulliken charges:
elementType: S O O O O N C C C C C C C C C C C C C H H H H H H H H H H H H H H H H H
charge: 0.919664 -0.506332 -0.520903 -0.252854 -0.252399 -0.568671 -0.167586 0.503865 -0.230221 -0.517295 -0.380739 -0.250407 0.264569 -0.225950 -0.223745 -0.306014 -0.349496 -0.346394 -0.685713 0.279301 0.348703 0.286229 0.244294 0.241281 0.274514 0.237790 0.245660 0.225041 0.230726 0.228532 0.207627 0.193514 0.203889 0.211842 0.217531 0.220148
chargesum: 0.00000
title: Mulliken charges with hydrogens summed into heavy atoms:
elementType: S O O O O N C C C C C C C C C C C C C
charge: 0.919664 -0.506332 -0.520903 -0.252854 -0.252399 -0.219968 0.111715 0.503865 -0.230221 0.013228 -0.139458 0.024107 0.264569 0.011840 0.021915 0.149753 0.086663 0.051008 -0.036193
polarizability: 2.30767088e+02 1.97754142e+00 1.91464229e+02 1.32620160e+01 2.41325579e+00 1.28296260e+02
1716.lowfreq: -4.6584 0.0011 0.0012 0.0023 4.2131 9.3298 17.8717 23.0799 43.6703
frequency: 17.8580 22.9852 43.6568 63.9395 71.2666 82.2416 85.2780 97.3611 109.4005 141.9493 160.8166 198.6800 203.4824 219.7944 238.7873 249.6288 293.1718 305.1505 321.6749 379.4106 398.1644 410.5001 431.2143 451.6815 457.0523 479.3398 489.7497 535.6414 577.2159 598.3620 656.3822 672.4549 721.8018 745.9893 762.7083 767.4073 796.1542 817.7625 828.7667 861.5910 880.2238 899.4605 909.9162 931.3348 946.9203 949.8147 956.8176 997.2964 1009.9921 1019.8695 1031.9242 1034.7375 1075.2152 1085.8720 1113.6615 1130.1254 1151.4167 1167.4873 1171.4594 1179.9146 1209.8167 1217.7026 1228.7348 1273.0409 1273.6282 1290.2034 1292.9048 1299.5607 1325.1965 1345.2945 1350.9758 1371.9555 1391.0690 1392.9797 1415.9018 1432.2015 1455.5896 1458.1738 1472.4174 1478.2671 1478.9768 1490.3957 1582.7533 1615.5017 1624.6636 2946.8210 2970.1978 2978.0085 2994.6007 3012.1045 3015.5322 3026.1181 3054.7405 3075.3319 3075.8984 3078.9446 3107.4280 3136.3906 3149.4965 3161.0648 3175.6855 3442.9628
redmass: 5.1946 4.4571 5.8965 3.8486 2.8531 3.5694 3.6547 6.1784 2.4894 3.5943 6.0834 3.6970 4.4764 6.9769 1.1659 3.9986 6.4948 4.1278 7.7400 3.3014 4.0213 3.3750 3.6314 7.7991 4.3924 5.3576 4.1466 3.1225 4.0871 4.0681 5.9488 4.7039 4.1578 1.0736 1.5989 1.7949 1.4947 2.1044 13.7387 2.0061 1.9532 1.8778 2.7919 2.0738 16.0342 1.5189 1.5664 1.3426 5.8819 2.8488 3.6521 2.3263 2.4532 3.9280 2.4895 1.6871 2.7535 1.8070 1.2693 1.1779 1.3634 1.3134 1.3107 1.2851 1.3801 1.1713 1.0682 1.5543 1.3016 1.4359 1.7191 1.4617 7.1071 1.2278 1.0946 2.2592 1.0992 2.5051 1.0684 1.0454 1.0589 1.0878 6.3951 7.7712 8.5933 1.0820 1.0589 1.0364 1.0597 1.0600 1.1002 1.0580 1.1032 1.1003 1.1011 1.0996 1.1085 1.0870 1.0898 1.0947 1.1005 1.0763
irintensity: 1.1640 0.6261 0.0808 0.1285 0.5984 0.3701 1.1066 0.9984 0.1522 1.0115 1.4159 1.5972 5.6443 3.7947 2.4239 8.7167 30.5704 22.2784 8.2939 6.0082 8.4710 17.0790 17.9911 52.9140 44.5833 45.9551 9.5175 2.8745 14.2058 13.0853 4.9503 2.0799 2.2217 10.0463 31.1138 75.0618 1.1737 3.7847 113.9722 2.1753 2.9748 10.9096 6.2894 37.5497 105.2372 11.8981 7.4248 0.0609 3.3276 9.1322 11.9417 11.4272 4.4536 23.1575 74.8448 32.2688 341.3854 50.2040 22.6081 14.4587 26.3935 10.6180 4.7953 2.9719 14.0399 0.5437 1.4682 50.3396 2.7235 5.6402 60.5756 8.7072 0.5341 9.9986 29.0158 9.7674 9.7144 17.5492 0.7416 11.4404 5.3776 19.9421 0.3782 3.0919 147.1932 19.5426 31.9204 29.4363 20.9824 7.8664 8.2640 43.5331 7.7563 4.3037 62.3477 50.5361 29.5733 2.7293 8.6722 5.6663 17.6993 74.4994
temp: 298.150 k
press: 1.00000 atm
elementType: 16 8 8 8 8 7 6 6 6 6 6 6 6 6 6 6 6 6 6 1 1 1 1 1 1 1 1 1 1 1 1 1 1 1 1 1
symmnumber: 1
zpe: 739167.5 jmol-1
zpe.correction: 0.281534 hartree
zpe.thermalcorrener: 0.301326 hartree
zpe.thermalcorrenthalpy: 0.302270 hartree
zpe.thermalcorrgfe: 0.230597 hartree
zpe.sumelectzpe: -1257.681274 hartree
zpe.sumelectthermal: -1257.661482 hartree
zpe.sumelectthermalent: -1257.660538 hartree
zpe.sumelectthermalfe: -1257.732211 hartree
dipole: 2.6530 -7.6936 -0.4259
dipole: 8.1493
quadrupole: -96.1075 -127.9231 -128.8069
quadrupole: 18.6365 5.7486 -0.9793
quadrupole: 21.5050 -10.3106 -11.1944 18.6365 5.7486 -0.9793
hfenergy: -1257.9628079 hartree
pointgroup: C01 [X(C13H17N1O4S1)]
dipole: -0.8396723 3.0913961 0.1332748 debye
polarizability: 230.6182887|0.6705466|191.0970241|-14.2699439|4.4459146|128.8122639 unknown
InChI: InChI=1S/C13H17NO4S/c1-2-3-8-18-13(15)9-11-10-6-4-5-7-12(10)19(16,17)14-11/h4-7,11,14H,2-3,8-9H2,1H3
charge 0 multiplicity 1
36 atoms
S  2.148999 -2.134283 -0.215823
O  2.138388 -2.955807 -1.61097
O  2.656802 -2.914678 1.123763
O  -2.707859 1.515113 0.236779
O  -1.947366 -0.464125 1.209247
N  0.536288 -1.235632 0.018258
C  0.757824 0.128944 0.569935
C  2.14785 0.565804 0.102031
C  2.993066 -0.457678 -0.351303
C  -0.370298 1.04488 0.047986
C  2.664587 1.880566 0.122143
C  4.306573 -0.269423 -0.79805
C  -1.728155 0.59199 0.564696
C  3.986309 2.116512 -0.321863
C  4.803822 1.055089 -0.782834
C  -4.11815 1.171332 0.620725
C  -4.789982 0.326154 -0.468052
C  -6.266551 0.021187 -0.117542
C  -6.967102 -0.809598 -1.214175
H  0.735526 0.129665 1.681708
H  -0.141637 -1.803435 0.552334
H  -0.382362 1.016165 -1.056725
H  -0.210329 2.096522 0.348595
H  2.049505 2.714949 0.476447
H  4.918224 -1.106418 -1.14812
H  4.382977 3.137093 -0.30984
H  5.822766 1.25781 -1.127704
H  -4.601603 2.155289 0.735191
H  -4.097328 0.637688 1.58792
H  -4.235319 -0.623453 -0.589344
H  -4.739435 0.865533 -1.433562
H  -6.816662 0.972312 0.034057
H  -6.311001 -0.526246 0.845475
H  -6.967318 -0.272065 -2.180809
H  -6.453476 -1.776802 -1.367334
H  -8.017472 -1.023154 -0.945442
