program: Gaussian 09
title: 000216748
version: EM64L-G09RevD.01
frameworkgroup: C1[X(C21H27N3O)]
method: RPBEPBE
basis: SDD
operation: Freq
keyword: #p
keyword: freq=noraman
keyword: PBEPBE/SDD
title: #p freq=noraman PBEPBE/SDD
converged: YES YES NO NO
title: Mulliken charges:
elementType: O N N N C C C C C C C C C C C C C C C C C C C C C H H H H H H H H H H H H H H H H H H H H H H H H H H H
charge: -0.264331 -0.097634 -0.078265 -0.620100 -0.366735 -0.371985 -0.378203 -0.368290 -0.502287 -0.330965 0.279212 -0.528370 0.328064 -0.379900 -0.744025 -0.422988 0.228557 -0.252406 0.493278 -0.251561 -0.392336 -0.439207 -0.225777 -0.224319 -0.250569 0.185331 0.202557 0.221255 0.201735 0.210667 0.184604 0.197115 0.183614 0.220423 0.224612 0.255474 0.182656 0.212068 0.255669 0.277382 0.235039 0.224029 0.235064 0.224874 0.225654 0.247583 0.231296 0.333471 0.312805 0.223937 0.224967 0.227258
chargesum: 0.00000
title: Mulliken charges with hydrogens summed into heavy atoms:
elementType: O N N N C C C C C C C C C C C C C C C C C C C C C
charge: -0.264331 -0.097634 -0.078265 0.026177 0.021153 0.051006 0.017069 0.012439 -0.057253 0.107164 0.279212 -0.060633 0.328064 -0.102518 -0.284957 -0.187925 0.228557 -0.027532 0.493278 -0.025907 -0.144753 -0.207911 -0.001840 0.000648 -0.023311
polarizability: 2.58130824e+02 -1.51289076e+01 2.44780049e+02 -7.05628793e+00 1.24518813e+01 2.21155056e+02
1716.lowfreq: -7.7144 -5.5465 -2.0616 -0.0001 0.0002 0.0006 11.7770 22.8518 27.5492
frequency: 11.3223 22.8369 27.5447 34.8589 40.6770 45.5749 56.0983 65.6327 79.1923 88.8785 137.8950 155.0030 171.2704 203.9915 222.4540 243.9888 247.7130 268.0651 285.3700 292.9734 334.7720 342.0921 392.7910 404.3061 405.4974 443.3900 446.2268 455.0911 479.4142 483.2964 497.6558 505.6001 529.6124 552.0290 582.0116 603.1028 614.5359 621.5630 628.2277 666.6679 704.3361 728.2937 735.8277 756.0653 761.8828 784.4389 791.4376 794.8243 812.8709 841.2441 846.7485 856.1779 871.3740 888.2131 903.0181 926.5143 947.5172 962.6242 979.5644 989.6299 990.0220 995.5916 1004.0568 1007.5666 1018.5543 1026.5210 1031.3987 1041.1413 1056.0760 1057.2417 1078.9763 1081.2662 1087.1222 1102.2962 1134.8739 1135.0480 1142.8289 1157.8119 1166.8998 1170.9055 1177.1072 1179.9764 1188.5789 1193.7992 1203.1633 1205.2661 1221.7480 1235.8029 1260.9000 1267.5409 1273.9888 1286.6318 1294.0848 1299.8935 1306.8238 1334.5234 1335.2440 1335.7937 1347.8973 1363.5806 1372.9159 1376.3214 1381.5962 1392.9198 1396.4840 1436.2998 1439.5369 1444.9067 1453.0159 1455.1296 1460.4702 1462.5477 1466.8021 1476.5638 1480.0702 1482.1116 1484.8151 1586.5931 1591.8864 1595.0491 1609.8586 1614.1006 1643.1277 2846.4150 2850.4746 2861.3890 2870.1112 2877.9510 2892.6973 2974.0389 2977.9397 2985.8708 3022.5147 3024.1464 3032.6419 3034.9103 3039.0780 3044.0411 3057.0530 3110.8580 3111.2367 3121.2341 3124.8438 3134.2424 3140.5066 3144.2126 3157.0814 3161.3743 3515.8380 3673.4275
redmass: 5.9075 4.3472 5.3621 3.8971 4.2227 3.5079 3.8430 3.8468 4.2082 2.8952 4.4978 3.7987 3.7481 4.2269 3.1852 2.7607 2.9609 2.5216 2.3955 4.2990 2.0891 3.2130 2.5318 2.6955 2.1109 3.1559 2.6868 3.3295 2.7184 3.6086 1.4058 3.2567 1.7605 4.9163 2.5226 4.5516 5.3112 4.4380 1.9812 1.9740 2.1957 2.2905 2.3613 1.4636 3.7560 2.9848 1.5976 2.3467 3.0060 2.8264 1.9001 1.2486 2.9367 1.3601 1.4674 2.0857 1.7686 1.4641 1.3827 1.7117 5.5146 1.3188 2.2358 1.6363 2.1091 2.2544 1.9926 2.1317 1.8343 2.2078 1.8799 2.0311 2.1511 2.1078 2.3238 2.7865 2.7056 2.2919 1.0857 1.0590 1.2400 2.0169 1.1208 1.1667 1.3494 1.9659 2.3722 1.2696 1.5078 1.5468 1.3708 1.5600 1.3792 1.4040 1.2985 1.3368 1.3418 1.4008 1.7782 1.6595 1.6869 2.5757 5.6477 1.5992 1.8295 2.0926 2.2002 1.0915 1.1017 1.0842 1.1173 1.1284 1.1733 1.3148 1.1934 1.8245 1.6733 6.6662 6.0789 1.4208 6.2076 6.2225 3.6128 1.0714 1.0706 1.0701 1.0697 1.0690 1.0664 1.0613 1.0893 1.0588 1.0993 1.0902 1.0880 1.0914 1.0915 1.0883 1.0959 1.0871 1.0873 1.0858 1.0877 1.0912 1.0931 1.0958 1.1005 1.1014 1.0446 1.1043
irintensity: 0.0291 1.8250 9.0824 0.6121 1.3554 1.7639 1.0814 0.5379 0.7623 0.0138 0.6681 11.5621 0.6591 0.8756 3.2205 0.9500 3.2182 0.3157 1.0108 3.2726 12.6391 3.3800 0.6751 0.0561 0.4842 4.5202 4.2911 4.7680 3.2250 3.7214 70.3676 9.7114 124.3429 6.5218 31.1683 6.6022 4.1942 13.9329 17.0638 38.3786 33.0477 30.8286 36.8511 53.4007 2.3073 11.0352 4.9611 26.8771 7.9804 0.9437 0.6542 0.5448 6.4338 0.8413 1.8883 2.7911 5.2003 5.6016 0.1460 9.9562 0.7124 0.7399 47.0929 3.9577 5.5887 7.5426 3.7247 13.2530 0.4959 4.6172 10.8622 1.3442 15.1177 2.9721 35.2401 28.7026 43.9968 20.2111 2.9139 0.2008 0.2112 1.4062 0.9068 2.7311 0.9096 4.1398 3.1622 5.8729 4.1538 62.6373 10.9819 13.2539 26.2953 23.9632 4.9736 7.9274 20.2952 1.1032 41.8016 30.9313 80.1741 2.3411 0.5650 18.1936 5.6735 10.3699 8.9915 11.7620 1.2364 0.6065 7.1257 27.8742 14.4392 29.9625 13.2123 9.9002 7.6102 0.1198 0.8890 69.4519 8.5818 5.6598 276.4603 49.8393 48.6801 49.1882 51.9012 134.5297 128.7369 34.9196 16.9893 14.4876 14.5362 41.4622 49.0678 39.9242 5.5121 18.5331 35.5833 9.6181 8.9993 0.2852 8.9313 13.3120 15.5539 36.2271 41.8913 24.0590 27.7783 20.6273
temp: 298.150 k
press: 1.00000 atm
elementType: 8 7 7 7 6 6 6 6 6 6 6 6 6 6 6 6 6 6 6 6 6 6 6 6 6 1 1 1 1 1 1 1 1 1 1 1 1 1 1 1 1 1 1 1 1 1 1 1 1 1 1 1
symmnumber: 1
zpe: 1155949.2 jmol-1
zpe.correction: 0.440278 hartree
zpe.thermalcorrener: 0.463866 hartree
zpe.thermalcorrenthalpy: 0.464810 hartree
zpe.thermalcorrgfe: 0.383121 hartree
zpe.sumelectzpe: -1054.051108 hartree
zpe.sumelectthermal: -1054.027520 hartree
zpe.sumelectthermalent: -1054.026576 hartree
zpe.sumelectthermalfe: -1054.108265 hartree
dipole: 1.1738 1.4143 -3.0150
dipole: 3.5311
quadrupole: -161.3926 -146.4789 -134.8062
quadrupole: -7.5095 25.1638 -2.1033
quadrupole: -13.8334 1.0803 12.7530 -7.5095 25.1638 -2.1033
hfenergy: -1054.4913861 hartree
pointgroup: C01 [X(C21H27N3O1)]
dipole: -0.4585476 0.6882895 1.1162128 debye
polarizability: 259.1723157|14.0482685|241.1869408|-8.4823614|-14.1613679|223.7066725 unknown
InChI: InChI=1S/C21H27N3O/c22-21(25)10-11-23-12-14-24(15-13-23)17-20-9-5-4-8-19(20)16-18-6-2-1-3-7-18/h1-9H,10-17,22H2
charge 0 multiplicity 1
52 atoms
O  7.225354 -0.033289 -0.383426
N  0.18605 -1.220905 -0.883039
N  2.987756 -0.509837 -0.579016
N  7.130544 0.980195 1.697113
C  1.095939 -1.158105 -2.052515
C  0.628455 -0.263074 0.162358
C  2.538082 -1.468282 -1.620896
C  2.07317 -0.564039 0.589749
C  -1.234693 -1.024207 -1.258683
C  4.41039 -0.716695 -0.220379
C  -2.213353 -1.49714 -0.181587
C  4.999786 0.481998 0.549912
C  -3.507779 -0.913516 -0.039745
C  -1.848052 -2.582133 0.653129
C  -3.969789 0.263439 -0.898433
C  -4.39239 -1.43974 0.936467
C  6.534198 0.437434 0.567814
C  -2.736917 -3.093647 1.623163
C  -3.317876 1.609806 -0.557889
C  -4.02025 -2.520194 1.766492
C  -3.057231 1.978351 0.786784
C  -3.000909 2.534038 -1.586375
C  -2.497616 3.238814 1.094538
C  -2.442655 3.796388 -1.282628
C  -2.187888 4.153967 0.061448
H  1.076724 -0.148806 -2.536281
H  0.767769 -1.905205 -2.79995
H  -0.04388 -0.354334 1.034201
H  0.569925 0.790704 -0.208617
H  3.211346 -1.380462 -2.49366
H  2.580471 -2.525235 -1.253301
H  2.388598 0.189964 1.333615
H  2.105523 -1.570237 1.082545
H  -1.414184 -1.61518 -2.181072
H  -1.438608 0.04163 -1.518939
H  4.995827 -0.826488 -1.15068
H  4.561937 -1.655569 0.371808
H  4.605082 0.545327 1.581406
H  4.688024 1.404182 0.020324
H  -0.84667 -3.0071 0.521792
H  -5.066558 0.367903 -0.776366
H  -3.805381 0.052811 -1.972867
H  -5.389267 -0.993075 1.042472
H  -2.433113 -3.934296 2.257558
H  -4.723149 -2.908817 2.512068
H  -3.2851 1.269735 1.591403
H  -3.19364 2.263254 -2.63259
H  8.149074 1.017307 1.739332
H  6.585348 1.35263 2.472237
H  -2.303141 3.507189 2.139531
H  -2.203457 4.496362 -2.091466
H  -1.752823 5.131079 0.299838
