program: Gaussian 09
title: 000211517
version: EM64L-G09RevD.01
frameworkgroup: C1[X(C14H20N2O2)]
method: RPBEPBE
basis: SDD
operation: Freq
keyword: #p
keyword: freq=noraman
keyword: PBEPBE/SDD
title: #p freq=noraman PBEPBE/SDD
converged: YES YES NO NO
title: Mulliken charges:
elementType: O O N N C C C C C C C C C C C C C C H H H H H H H H H H H H H H H H H H H H
charge: -0.288230 -0.271700 -0.253901 -0.228162 -0.107797 -0.456142 -0.541326 -0.456425 0.259110 0.219741 -0.479065 0.253635 -0.309581 -0.365548 -0.685960 -0.260052 -0.229583 -0.544951 0.270146 0.240683 0.216345 0.226304 0.274663 0.222372 0.221474 0.273282 0.243902 0.235928 0.246301 0.244057 0.203322 0.219348 0.240258 0.234345 0.229663 0.225940 0.224092 0.253515
chargesum: 0.00000
title: Mulliken charges with hydrogens summed into heavy atoms:
elementType: O O N N C C C C C C C C C C C C C C
charge: -0.288230 -0.271700 -0.253901 0.045119 0.162349 0.000886 -0.040360 -0.012580 0.259110 0.219741 0.000765 0.253635 -0.063279 -0.121492 -0.023033 -0.025707 0.000080 0.158596
polarizability: 1.57913295e+02 -1.96301018e+00 1.86137892e+02 1.54220244e+01 -7.75040583e+00 1.56624625e+02
1716.lowfreq: -0.0004 0.0004 0.0007 2.5480 8.2087 13.1052 39.0263 42.3070 48.1829
frequency: 37.4786 42.1686 47.7546 55.5851 74.3554 76.0022 99.9380 112.3324 150.7538 174.7575 194.7251 206.6252 238.4840 253.5247 273.2334 289.0065 320.3633 322.5236 382.5103 426.5793 448.5299 508.7594 518.9028 552.0634 572.9150 582.9956 630.0866 648.7317 690.7994 717.2953 747.1144 749.2460 759.6111 765.1359 802.5188 813.7542 834.8580 854.8151 901.0202 921.8632 931.6600 942.2603 974.8694 977.0894 979.8988 983.3438 1020.3008 1035.1566 1044.7044 1077.4651 1079.4312 1091.5592 1099.0255 1113.4019 1114.4758 1151.9330 1171.6086 1178.4915 1197.4259 1199.3537 1217.1801 1235.5598 1252.4599 1261.1441 1275.7371 1285.0288 1294.4303 1305.1224 1333.6649 1344.9878 1367.5325 1388.6964 1391.4833 1427.2873 1428.9254 1446.1469 1448.6775 1466.6705 1466.7773 1469.5219 1469.9535 1471.1424 1479.8236 1481.8851 1489.0196 1583.6393 1586.8548 1603.5724 2965.2653 2982.3274 2990.8215 2993.1258 2994.4207 3022.0794 3037.0521 3055.5086 3057.6529 3065.4511 3087.5505 3088.4422 3101.7926 3105.2622 3131.6984 3135.1574 3147.9170 3161.1014 3172.8115 3423.3957
redmass: 3.8136 2.3087 3.7830 3.2301 3.3896 3.1056 2.9677 3.4540 3.2921 2.8064 1.2478 3.2341 1.6762 1.8801 3.9748 3.2376 3.6347 2.6855 5.8510 3.9340 2.9944 3.4885 3.4586 5.3799 3.2660 3.9248 4.5685 2.8887 4.3331 2.5442 1.9907 3.5405 1.3225 4.2418 1.3550 1.6876 3.1647 1.5732 2.5486 2.8829 2.4398 1.4368 2.3413 1.9607 1.5900 5.8691 1.7744 1.8971 1.9465 2.2961 1.6508 2.7111 3.5018 1.4133 1.5593 1.3921 1.1377 1.3215 1.2382 1.2569 2.7813 3.1821 1.3442 1.8155 1.5765 1.4648 1.3147 1.2424 1.3183 2.0804 9.6726 1.5078 1.2144 1.2022 1.4307 1.5206 1.1106 1.0950 1.0526 1.0945 1.1228 1.0634 1.1062 1.0610 2.0655 7.2929 7.1704 6.8151 1.0329 1.0604 1.0675 1.0652 1.0376 1.0621 1.0976 1.1042 1.0911 1.0956 1.1000 1.1032 1.0968 1.0997 1.0993 1.0857 1.0898 1.0938 1.1002 1.0746
irintensity: 0.2495 0.1658 0.2204 0.9516 1.2760 2.3496 4.6906 1.2101 3.2937 1.4020 1.1705 0.4052 1.4203 2.2490 6.9689 4.0641 2.6636 6.9980 10.6469 4.3951 2.6563 2.5124 3.4843 6.7197 2.5788 2.4740 2.2822 4.7634 3.6980 21.0879 110.2195 15.1761 83.8313 23.9054 12.0644 8.2294 3.3300 0.8322 2.8249 12.8579 0.1032 2.0900 13.0981 2.1928 4.3598 35.0832 12.5502 17.4674 13.7414 5.3192 0.1853 3.7885 9.8019 18.0019 30.2898 1.4330 12.1282 22.8334 4.9627 8.5339 99.1558 146.2451 7.5588 62.0284 8.4302 14.4445 8.8657 1.7423 5.3473 74.8533 10.4035 37.5508 21.2405 14.4873 9.2803 11.4425 28.0718 8.5016 17.1440 5.4096 74.0498 21.0770 10.2662 11.8086 67.3277 81.1787 121.9031 83.5888 60.4094 19.7093 40.5945 81.4391 29.3708 33.8919 7.7692 37.9261 5.5278 14.3868 34.5594 50.0548 11.8800 25.7290 15.6776 0.1552 10.0137 19.7802 13.5722 0.8983
temp: 298.150 k
press: 1.00000 atm
elementType: 8 8 7 7 6 6 6 6 6 6 6 6 6 6 6 6 6 6 1 1 1 1 1 1 1 1 1 1 1 1 1 1 1 1 1 1 1 1
symmnumber: 1
zpe: 838312.6 jmol-1
zpe.correction: 0.319296 hartree
zpe.thermalcorrener: 0.337459 hartree
zpe.thermalcorrenthalpy: 0.338403 hartree
zpe.thermalcorrgfe: 0.272065 hartree
zpe.sumelectzpe: -804.046475 hartree
zpe.sumelectthermal: -804.028312 hartree
zpe.sumelectthermalent: -804.027368 hartree
zpe.sumelectthermalfe: -804.093706 hartree
dipole: 0.6678 5.1536 -0.8537
dipole: 5.2663
quadrupole: -113.1074 -108.1874 -99.0965
quadrupole: 12.3716 8.1418 4.9323
quadrupole: -6.3103 -1.3903 7.7006 12.3716 8.1418 4.9323
hfenergy: -804.3657711 hartree
pointgroup: C01 [X(C14H20N2O2)]
dipole: -1.3532869 -1.5295957 -0.3490991 debye
polarizability: 162.1461476|14.8467879|176.2372492|-7.7534509|15.2948256|162.292416 unknown
InChI: InChI=1S/C14H20N2O2/c1-3-14(17)16(11-8-9-15-10-11)12-6-4-5-7-13(12)18-2/h4-7,11,15H,3,8-10H2,1-2H3
charge 0 multiplicity 1
38 atoms
O  0.482253 3.043846 0.683771
O  -1.240726 -0.584422 1.719702
N  0.415409 0.817747 -0.009356
N  2.565952 -1.705091 0.239414
C  1.847348 0.638927 0.392969
C  2.83829 0.509344 -0.814957
C  2.103601 -0.672478 1.205793
C  3.417145 -0.950158 -0.726939
C  -0.342111 -0.313867 -0.486157
C  -0.184171 2.070254 0.215212
C  -1.672691 2.196599 -0.132746
C  -1.188129 -1.052788 0.400282
C  -0.266038 -0.717911 -1.839585
C  -1.913808 -2.173676 -0.071771
C  -2.136478 3.663908 -0.176767
C  -0.985931 -1.837395 -2.315832
C  -1.806199 -2.563539 -1.425689
C  -2.084945 -1.311979 2.67419
H  2.068156 1.540488 0.98777
H  3.637051 1.267533 -0.736455
H  2.311665 0.692939 -1.766519
H  2.921913 -0.47513 1.925399
H  1.223408 -1.007549 1.775617
H  3.439814 -1.46585 -1.702479
H  4.452277 -0.919201 -0.337265
H  1.760426 -2.130979 -0.2432
H  -2.2423 1.639586 0.638216
H  -1.881053 1.689592 -1.093659
H  0.358976 -0.131271 -2.52072
H  -2.559258 -2.743677 0.602988
H  -3.226517 3.718964 -0.351354
H  -1.624469 4.218796 -0.982164
H  -1.898784 4.174353 0.77112
H  -0.911896 -2.130935 -3.367712
H  -2.370777 -3.432585 -1.780868
H  -1.748621 -2.360181 2.789976
H  -3.14813 -1.292601 2.366673
H  -1.963053 -0.774419 3.625403
