program: Gaussian 09
title: 000211515
version: EM64L-G09RevD.01
frameworkgroup: C1[X(C16H21F3N2O)]
method: RPBEPBE
basis: SDD
operation: Freq
keyword: #p
keyword: freq=noraman
keyword: PBEPBE/SDD
title: #p freq=noraman PBEPBE/SDD
converged: YES YES NO NO
title: Mulliken charges:
elementType: F F F O N N C C C C C C C C C C C C C C C C H H H H H H H H H H H H H H H H H H H H H
charge: -0.164442 -0.117136 -0.167557 -0.204573 -0.041612 -0.283828 -0.096221 -0.471825 -0.474040 -0.458183 -0.325987 0.325707 0.128060 -0.667574 0.187454 -0.358930 0.360425 0.277765 -0.824817 -0.249223 -0.443985 -0.826870 0.263744 0.232235 0.249756 0.241387 0.247336 0.225147 0.231036 0.207475 0.201098 0.209530 0.228777 0.206841 0.252798 0.240441 0.226547 0.266196 0.232873 0.235276 0.229118 0.231265 0.238515
chargesum: 0.00000
title: Mulliken charges with hydrogens summed into heavy atoms:
elementType: F F F O N N C C C C C C C C C C C C C C C C
charge: -0.164442 -0.117136 -0.167557 -0.204573 -0.041612 -0.283828 0.167523 0.010166 0.014684 -0.002000 0.082586 0.325707 0.128060 -0.022426 0.187454 -0.106131 0.360425 0.277765 -0.091633 -0.016350 -0.208709 -0.127972
polarizability: 2.03847864e+02 -1.14684331e+01 1.86268756e+02 2.57867038e+00 1.02649520e+01 1.69595701e+02
1716.lowfreq: -9.7282 -4.3455 0.0007 0.0008 0.0009 6.4008 13.2694 30.5295 38.5412
frequency: 6.6341 30.1975 38.5396 51.1239 64.8847 78.4861 82.1750 107.4021 118.8823 125.1745 130.7853 154.1834 164.7569 186.8743 220.8523 224.7681 241.0872 262.3869 264.4299 301.5692 309.6389 327.3838 347.9829 363.2754 405.0917 408.5587 438.2692 449.7779 458.3726 500.4590 514.1478 518.2958 534.3600 553.6155 588.8276 625.9760 638.3055 669.9360 698.4310 716.6722 754.6449 769.2811 790.6431 804.4852 808.1390 861.9464 869.6898 900.0843 909.7204 933.0589 948.4901 961.2206 973.9657 976.8599 991.0526 1008.7465 1027.1579 1047.5249 1049.8089 1052.8558 1056.3685 1072.8800 1085.6295 1089.9154 1098.0167 1116.6224 1139.8913 1165.3072 1179.1634 1187.9122 1196.5856 1209.6974 1239.4931 1264.6153 1270.7847 1282.4462 1286.3013 1291.2494 1312.9508 1319.0035 1335.7416 1363.1059 1366.2118 1384.7930 1394.9450 1405.9012 1418.9098 1439.2253 1454.7708 1463.7047 1465.1680 1467.0928 1468.6567 1473.4833 1477.5099 1478.5299 1484.2297 1486.8217 1489.9172 1588.7321 1607.2537 1610.3029 2866.9184 2973.6044 2977.1392 2980.9096 2984.2793 2994.6322 3024.2571 3027.2919 3048.3345 3064.7922 3069.5779 3074.5170 3077.2963 3086.9838 3090.5535 3093.1825 3097.7508 3108.1849 3127.0060 3146.8219 3167.8382
redmass: 3.7858 3.7984 6.3802 5.7982 3.6836 2.2743 9.1309 4.0691 2.3004 1.5702 1.0785 2.6179 2.7150 6.3368 7.1737 1.1799 3.2194 4.1802 4.8366 3.8505 2.8594 2.4347 3.9946 2.9968 8.5699 3.2986 2.7458 7.3131 4.8440 4.1267 4.4147 3.5816 4.7261 5.2478 4.3356 4.2685 8.3474 4.0911 10.0959 3.5400 2.5291 2.5661 1.7194 1.2118 4.2433 3.5073 1.9826 2.4623 1.4325 1.9631 2.1716 2.1348 1.3804 4.1162 1.4423 3.4195 1.4593 2.0954 3.5492 1.7088 3.6420 2.5262 2.0685 2.2549 1.9235 2.6018 5.9678 1.7910 1.3365 1.7128 2.7836 1.4917 2.3164 2.0776 1.5185 1.2051 1.2807 1.3294 2.6111 1.2560 1.5077 1.3256 6.6303 1.2275 1.2396 1.2223 1.4458 1.6947 1.9809 1.1325 1.1219 1.0890 1.0732 1.2884 1.1081 1.0997 1.1167 1.0734 1.0895 6.6242 6.4776 11.7555 1.0705 1.0381 1.0677 1.0360 1.0396 1.0658 1.0845 1.0638 1.0968 1.0945 1.0974 1.0983 1.0970 1.0983 1.0964 1.1005 1.0987 1.0947 1.0874 1.0914 1.0988
irintensity: 0.3287 0.2254 0.0186 0.7157 0.2443 0.3981 1.1359 1.4039 0.4314 1.3025 0.6365 0.5448 1.4077 3.6820 2.3846 0.0753 1.7118 0.7830 0.4396 7.9267 2.1891 0.5694 5.1992 4.8054 2.5212 1.3368 1.4928 1.1074 3.2093 0.1945 9.3014 7.7377 3.8601 11.2038 4.5798 18.6492 11.2834 14.2279 11.0356 5.9111 32.7970 10.3944 21.2730 7.5207 8.9873 17.8565 13.2708 1.2145 0.4914 1.2510 20.7054 36.6069 2.8818 138.4375 7.0428 51.7412 9.2009 8.5650 84.4690 6.6379 70.4377 84.2354 28.3563 3.2961 12.4375 157.8166 90.9182 3.9590 4.2968 3.4476 6.4105 21.5049 4.6837 1.7517 11.4908 7.8785 2.5242 6.0039 15.1746 2.0938 17.8936 4.0998 0.5413 22.4291 5.2226 34.7232 10.0459 18.5598 4.0115 15.0698 2.6037 12.9292 11.3492 22.4326 3.5248 9.6060 22.5724 11.7698 4.1433 39.0590 5.5519 283.9558 68.1526 28.8726 65.7490 21.3728 14.1005 35.1659 17.9861 12.1476 20.5335 9.8280 19.7837 24.6738 53.5575 25.2776 7.2659 36.2486 13.0517 31.8935 8.4558 18.3599 12.8741
temp: 298.150 k
press: 1.00000 atm
elementType: 9 9 9 8 7 7 6 6 6 6 6 6 6 6 6 6 6 6 6 6 6 6 1 1 1 1 1 1 1 1 1 1 1 1 1 1 1 1 1 1 1 1 1
symmnumber: 1
zpe: 905774.4 jmol-1
zpe.correction: 0.344991 hartree
zpe.thermalcorrener: 0.367490 hartree
zpe.thermalcorrenthalpy: 0.368435 hartree
zpe.thermalcorrgfe: 0.291049 hartree
zpe.sumelectzpe: -1104.867444 hartree
zpe.sumelectthermal: -1104.844945 hartree
zpe.sumelectthermalent: -1104.844001 hartree
zpe.sumelectthermalfe: -1104.921387 hartree
dipole: 4.7925 1.7121 0.5219
dipole: 5.1158
quadrupole: -135.4462 -136.2231 -124.0838
quadrupole: -12.2966 0.8995 8.0280
quadrupole: -3.5285 -4.3054 7.8339 -12.2966 0.8995 8.0280
hfenergy: -1105.2124357 hartree
pointgroup: C01 [X(C16H21F3N2O1)]
dipole: -1.8535116 -0.7533192 0.2190497 debye
polarizability: 204.8455008|-10.6641648|184.8471586|-1.8679466|-10.6893997|170.0196614 unknown
InChI: InChI=1S/C16H21F3N2O/c1-4-20-9-8-13(10-20)21(15(22)16(17,18)19)14-7-5-6-11(2)12(14)3/h5-7,13H,4,8-10H2,1-3H3
charge 0 multiplicity 1
43 atoms
F  3.697393 -0.488685 0.716022
F  4.281768 1.470873 -0.238943
F  3.38936 -0.157216 -1.524618
O  1.793387 2.337071 0.131198
N  -0.712194 -3.107187 -0.459403
N  0.833818 0.194626 0.140522
C  0.924177 -1.289607 -0.05514
C  0.741571 -2.152438 1.223942
C  -0.142185 -1.871371 -1.072824
C  0.252058 -3.492515 0.61343
C  -2.125842 -2.96694 -0.006312
C  -0.465286 0.792333 0.45353
C  1.888091 1.084528 0.025794
C  -3.108528 -2.994509 -1.19155
C  -1.216381 1.439109 -0.567586
C  -0.922089 0.743278 1.790182
C  -2.482205 2.005868 -0.222011
C  3.30438 0.48182 -0.250541
C  -0.666184 1.58835 -1.972918
C  -2.174222 1.298425 2.118987
C  -2.948218 1.914802 1.112392
C  -3.323619 2.721813 -1.264532
H  1.921899 -1.502751 -0.463928
H  -0.047713 -1.73736 1.872834
H  1.676999 -2.235403 1.802559
H  -0.94348 -1.141986 -1.277841
H  0.360045 -2.10424 -2.030102
H  1.103616 -4.038088 0.159313
H  -0.226464 -4.162512 1.346712
H  -2.341691 -3.824424 0.658293
H  -2.29444 -2.036825 0.59146
H  -2.933207 -2.148895 -1.881934
H  -2.987334 -3.930839 -1.763164
H  -4.152236 -2.92405 -0.832678
H  -0.283037 0.308923 2.56473
H  0.108464 0.837464 -2.197677
H  -1.458633 1.506364 -2.736581
H  -0.193415 2.582788 -2.088382
H  -2.534337 1.26697 3.152594
H  -3.920707 2.351901 1.3675
H  -3.620105 2.046386 -2.090033
H  -4.246384 3.126883 -0.816305
H  -2.772488 3.564366 -1.722692
