program: Gaussian 09
title: 000216695
version: EM64L-G09RevD.01
frameworkgroup: C1[X(C11H21N)]
method: RPBEPBE
basis: SDD
operation: Freq
keyword: #pfreq=noraman
keyword: PBEPBE/SDD
title: #p freq=noraman PBEPBE/SDD
converged: YES YES NO NO
title: Mulliken charges:
elementType: N C C C C C C C C C C C H H H H H H H H H H H H H H H H H H H H H
charge: -0.549360 0.264501 -0.508796 0.170245 -0.576126 0.323168 -0.569113 -0.771262 -0.744222 -0.847677 -0.119791 -0.691964 0.206305 0.216777 0.211331 0.222549 0.234761 0.187017 0.213550 0.220470 0.212207 0.207218 0.224281 0.212026 0.225352 0.222882 0.235751 0.219336 0.205798 0.198524 0.228571 0.253109 0.262587
chargesum: 0.00000
title: Mulliken charges with hydrogens summed into heavy atoms:
elementType: N C C C C C C C C C C C
charge: -0.033665 0.264501 -0.085715 0.170245 -0.142246 0.323168 -0.147335 -0.125036 -0.100697 -0.163693 0.099544 -0.059072
polarizability: 1.49853272e+02 7.66729553e+00 1.18805475e+02 3.37924050e+00 -9.65001977e-01 1.04544844e+02
1716.lowfreq: -10.2981 -0.0007 -0.0004 0.0002 8.4012 16.7532 37.5529 59.2689 76.8719
frequency: 37.3616 59.2075 76.8345 112.8257 160.1993 175.0196 208.4530 225.7353 230.5447 241.6530 256.1518 276.3346 283.6758 317.3703 330.0568 356.2544 365.5089 422.3427 438.0651 484.9800 552.6636 569.2020 639.5230 655.4368 679.8965 758.9102 815.5011 844.2503 884.9217 895.5042 919.8393 939.2752 941.5246 968.1126 994.5689 1007.1579 1011.4977 1033.7819 1041.0136 1082.2687 1104.8329 1118.7792 1137.5955 1152.8277 1194.8717 1204.8727 1214.4367 1239.3241 1253.2548 1271.3502 1292.6117 1311.5468 1319.4368 1326.7671 1365.1454 1368.3907 1375.7962 1386.7975 1396.2340 1454.6764 1456.7475 1461.2342 1463.5350 1466.1808 1469.2817 1472.1847 1475.8427 1477.7728 1483.2774 1485.7597 1634.8334 1684.9335 2945.9762 2959.6967 2960.1401 2962.9237 2963.2327 2967.3341 2988.4104 2988.9721 3011.6763 3021.9005 3027.1593 3051.6424 3057.3999 3059.7256 3061.8257 3064.7015 3065.0298 3068.3019 3075.7838 3416.2429 3541.8281
redmass: 2.8262 3.1851 2.9459 2.3828 1.1148 2.3128 1.3838 1.2259 1.3623 1.1552 1.0800 2.1777 2.3682 2.2407 2.2152 2.4117 2.2367 2.2773 1.9483 2.6309 3.6146 2.6624 3.6980 1.5273 3.5990 1.7714 2.5737 1.9162 1.8688 1.4676 1.6562 1.6875 1.6304 1.4637 1.5064 1.7095 1.5357 1.5693 1.8503 1.7289 1.7972 2.1183 1.7105 2.1939 1.7138 2.1182 2.1740 1.3971 1.8392 2.3728 1.5983 1.6133 1.3483 2.3564 1.3252 1.2019 1.2237 1.2449 1.2436 1.0816 1.0667 1.0513 1.0717 1.0526 1.0707 1.0611 1.0828 1.0538 1.0582 1.0616 1.0938 7.8307 1.0655 1.0399 1.0407 1.0513 1.0345 1.0360 1.0703 1.0793 1.0904 1.1001 1.0960 1.1029 1.1003 1.0990 1.0989 1.0998 1.0999 1.0992 1.0961 1.0446 1.0961
irintensity: 0.4707 0.4877 0.1954 0.5878 0.6266 0.0779 0.8884 21.9746 18.8261 5.7894 0.5727 0.7491 10.3504 3.8778 1.8282 11.7563 4.0531 7.5621 6.3070 4.2913 0.7538 0.6271 2.5148 224.0692 6.3587 2.6799 1.3491 0.7748 0.8334 4.2934 0.2016 1.4298 1.4086 0.7764 1.0721 4.3609 1.6852 5.1499 0.9967 19.7268 1.4611 15.6507 3.7997 42.9628 1.7530 1.7143 5.0243 3.1198 3.3915 0.3845 4.6821 0.1757 6.0301 9.9686 10.0089 16.1830 20.3569 9.2386 14.0694 2.9331 4.9339 4.7263 2.3043 14.6034 10.6855 6.1146 6.5503 9.0669 15.9629 2.8493 35.6810 0.4195 49.2884 25.3908 37.4042 27.9933 33.4776 38.6716 16.2270 36.3062 34.5973 41.7684 24.6838 17.5828 2.5355 38.0971 99.4562 37.2706 66.8137 54.3197 35.2638 3.9476 0.1622
temp: 298.150 k
press: 1.00000 atm
elementType: 7 6 6 6 6 6 6 6 6 6 6 6 1 1 1 1 1 1 1 1 1 1 1 1 1 1 1 1 1 1 1 1 1
symmnumber: 1
zpe: 778018.0 jmol-1
zpe.correction: 0.296331 hartree
zpe.thermalcorrener: 0.311103 hartree
zpe.thermalcorrenthalpy: 0.312048 hartree
zpe.thermalcorrgfe: 0.255632 hartree
zpe.sumelectzpe: -485.528089 hartree
zpe.sumelectthermal: -485.513317 hartree
zpe.sumelectthermalent: -485.512372 hartree
zpe.sumelectthermalfe: -485.568788 hartree
dipole: -0.1392 0.8400 1.0961
dipole: 1.3880
quadrupole: -73.8171 -75.0001 -78.9769
quadrupole: -3.4911 -4.2475 -2.2992
quadrupole: 2.1143 0.9313 -3.0456 -3.4911 -4.2475 -2.2992
hfenergy: -485.8244199 hartree
pointgroup: C01 [X(C11H21N1)]
dipole: -0.0644962 -0.3070445 -0.4469534 debye
polarizability: 149.3999177|-8.322423|119.2965982|-3.8951719|-0.1255808|104.5070739 unknown
InChI: InChI=1S/C11H21N/c1-8(12)7-10-5-6-11(3,4)9(10)2/h8H,5-7,12H2,1-4H3
charge 0 multiplicity 1
33 atoms
N  -4.062937 0.254817 0.437492
C  2.085846 0.089182 -0.139084
C  1.786154 1.583711 0.22202
C  0.788813 -0.616709 0.319932
C  0.237418 1.707073 0.246344
C  -0.227634 0.276183 0.519009
C  -1.658911 -0.000881 0.916859
C  3.353283 -0.428088 0.584397
C  2.262737 -0.084066 -1.677473
C  0.729286 -2.120809 0.431801
C  -2.710867 0.393102 -0.162074
C  -2.516553 -0.416468 -1.471225
H  2.2673 2.287385 -0.48203
H  2.184139 1.794764 1.233048
H  -0.157985 2.071782 -0.725979
H  -0.121056 2.420638 1.013695
H  -1.91821 0.574067 1.82868
H  -1.799367 -1.07333 1.164086
H  4.232358 0.185346 0.308654
H  3.232949 -0.377212 1.682588
H  3.580438 -1.476261 0.31197
H  2.347209 -1.15188 -1.954674
H  1.40191 0.342004 -2.225568
H  3.181029 0.426939 -2.0246
H  1.001253 -2.606111 -0.527139
H  -0.275597 -2.479403 0.713142
H  1.444719 -2.497721 1.18862
H  -2.577058 1.469328 -0.389714
H  -3.247354 -0.103436 -2.240848
H  -2.662189 -1.497777 -1.278832
H  -1.498546 -0.282147 -1.88296
H  -4.258253 -0.705658 0.749243
H  -4.814122 0.596636 -0.174179
