program: Gaussian 09
title: 000216687
version: EM64L-G09RevD.01
frameworkgroup: C1[X(C11H23N)]
method: RPBEPBE
basis: SDD
operation: Freq
keyword: #pfreq=noraman
keyword: PBEPBE/SDD
title: #p freq=noraman PBEPBE/SDD
converged: YES YES NO NO
title: Mulliken charges:
elementType: N C C C C C C C C C C C H H H H H H H H H H H H H H H H H H H H H H H
charge: -0.558335 0.299683 0.018405 -0.023327 -0.516079 -0.485287 -0.493937 -0.806067 -0.770763 -0.793638 -0.099650 -0.716672 0.173767 0.201377 0.211061 0.218680 0.213454 0.206272 0.191426 0.197501 0.219617 0.223617 0.225690 0.207270 0.212075 0.212202 0.214717 0.220788 0.215705 0.224024 0.240657 0.195380 0.207073 0.262039 0.251275
chargesum: 0.00000
title: Mulliken charges with hydrogens summed into heavy atoms:
elementType: N C C C C C C C C C C C
charge: -0.045021 0.299683 0.192172 0.178050 -0.086338 -0.065560 -0.105011 -0.137143 -0.139217 -0.142427 0.124374 -0.073562
polarizability: 1.42289246e+02 -2.05864619e+00 1.16250155e+02 1.55014433e+00 5.64216546e-01 1.10509179e+02
1716.lowfreq: -27.3207 -5.8060 -0.0003 0.0005 0.0006 8.1477 35.8671 64.4240 93.8781
frequency: 34.7145 64.3168 93.8513 98.5575 139.0498 198.0671 208.0975 228.2048 234.1633 235.0086 250.0760 252.4596 279.4659 296.4237 316.3049 354.9205 407.1084 423.7619 437.9473 502.8826 522.7697 540.1861 607.1611 629.1698 698.1346 787.9564 806.6011 835.5104 854.9049 884.1569 927.8808 930.9026 934.2739 957.9274 976.5589 986.6297 996.3414 1016.1839 1046.0134 1057.7239 1076.7843 1109.7854 1125.8360 1134.8138 1149.2458 1172.2634 1198.4666 1219.4695 1226.0918 1229.9970 1258.2923 1263.6885 1282.4659 1283.1118 1295.6905 1320.4908 1325.1228 1333.6981 1352.0540 1371.3132 1372.9899 1382.2293 1382.7790 1394.2695 1448.3999 1460.4283 1465.9715 1467.4218 1469.7286 1473.3766 1478.0781 1481.7832 1485.8866 1488.0120 1492.0639 1633.8069 2918.9119 2942.6393 2944.5322 2963.2650 2969.2289 2970.3646 2975.5096 2978.7230 2983.9116 2996.1680 3012.4943 3032.5362 3055.5982 3056.1297 3057.5241 3059.6069 3064.5328 3064.7905 3069.6537 3069.7881 3094.6871 3426.1909 3556.4656
redmass: 2.8525 2.9928 2.4950 2.0389 2.8799 1.0983 1.1164 1.3467 1.3825 1.7910 1.2461 1.7194 1.7810 2.1370 2.3116 2.2461 2.1254 2.1462 2.3858 2.1681 2.3805 3.0362 3.3481 1.5861 2.5883 2.0144 1.6102 2.0702 2.0440 1.5643 1.5536 1.4899 1.8107 1.4485 1.4312 1.3326 1.7613 2.8045 1.5682 1.5341 2.1360 2.0758 2.3708 2.2914 2.4053 1.5583 2.2133 1.8352 1.2074 2.2778 1.4882 1.3095 1.5495 1.4051 1.3024 1.4353 1.3276 1.5391 1.3867 1.4128 1.2494 1.2483 1.2383 1.2119 1.0893 1.0514 1.0577 1.0537 1.0628 1.0503 1.0507 1.0541 1.0757 1.0629 1.0590 1.0943 1.0811 1.0817 1.0608 1.0354 1.0358 1.0407 1.0370 1.0621 1.0793 1.0636 1.0988 1.1015 1.0992 1.1000 1.1000 1.0994 1.0966 1.0989 1.0990 1.0984 1.0998 1.0445 1.0964
irintensity: 0.2202 0.2137 0.4038 0.0375 0.4754 0.0381 0.1895 7.5264 0.8867 0.9971 36.4600 3.4175 1.1478 0.5029 1.2691 1.4158 8.9155 19.3200 9.2355 0.4071 9.9995 2.2393 21.0571 284.4517 13.1185 0.6193 2.0679 0.1372 0.1631 1.2996 1.0810 0.5899 1.0733 1.3203 0.1578 1.2658 2.7582 0.8900 13.5471 5.1720 1.3355 12.0903 3.5249 28.1703 10.4942 0.7541 14.2265 0.9903 0.8640 2.0756 1.8420 8.6335 0.5556 1.3915 1.6464 1.8189 5.4631 2.2655 0.4365 4.8051 23.0430 16.3301 18.1784 20.9308 2.2603 0.6928 8.4910 5.1720 8.0573 8.7769 9.1087 10.0366 7.3066 16.5251 4.7376 29.2429 16.6913 27.8349 29.0566 36.9828 34.7566 22.4428 22.6174 46.0610 21.1299 44.8977 53.9680 4.0651 23.9310 4.6220 24.8838 88.4542 41.3484 105.4599 45.8310 41.8041 34.6906 4.0289 0.4193
temp: 298.150 k
press: 1.00000 atm
elementType: 7 6 6 6 6 6 6 6 6 6 6 6 1 1 1 1 1 1 1 1 1 1 1 1 1 1 1 1 1 1 1 1 1 1 1
symmnumber: 1
zpe: 839907.3 jmol-1
zpe.correction: 0.319904 hartree
zpe.thermalcorrener: 0.334851 hartree
zpe.thermalcorrenthalpy: 0.335795 hartree
zpe.thermalcorrgfe: 0.279077 hartree
zpe.sumelectzpe: -486.710576 hartree
zpe.sumelectthermal: -486.695629 hartree
zpe.sumelectthermalent: -486.694685 hartree
zpe.sumelectthermalfe: -486.751403 hartree
dipole: -1.1814 -0.6234 -0.0330
dipole: 1.3362
quadrupole: -86.6361 -78.1432 -76.5773
quadrupole: -3.8338 2.2587 1.1832
quadrupole: -6.1839 2.3090 3.8749 -3.8338 2.2587 1.1832
hfenergy: -487.03048 hartree
pointgroup: C01 [X(C11H23N1)]
dipole: -0.4694581 -0.2348046 -0.0287312 debye
polarizability: 142.2380894|-2.6363618|116.1809932|0.8978544|1.1021142|110.6294979 unknown
InChI: InChI=1S/C11H23N/c1-8-5-6-10(7-9(2)12)11(8,3)4/h8-10H,5-7,12H2,1-4H3
charge 0 multiplicity 1
35 atoms
N  3.057893 0.366673 -1.419571
C  -1.165647 -0.648893 -0.060031
C  0.173961 0.167203 -0.177073
C  -2.212521 0.472532 -0.401474
C  -0.146111 1.54556 0.483003
C  -1.6927 1.731515 0.355839
C  1.443504 -0.515081 0.370042
C  -1.372173 -1.20754 1.371882
C  -1.221718 -1.810748 -1.077423
C  -3.690947 0.147324 -0.121356
C  2.769038 0.240359 0.031022
C  3.973411 -0.443192 0.709565
H  0.324335 0.336486 -1.268523
H  -2.107306 0.664734 -1.492332
H  0.411232 2.369164 0.000763
H  0.162484 1.53594 1.546429
H  -2.163625 1.789373 1.35617
H  -1.963438 2.661511 -0.176801
H  1.527233 -1.547113 -0.034525
H  1.366789 -0.607027 1.473176
H  -2.347662 -1.720591 1.456159
H  -0.589241 -1.946705 1.621383
H  -1.341142 -0.410753 2.137862
H  -1.080259 -1.441692 -2.111591
H  -0.436299 -2.563552 -0.87485
H  -2.196078 -2.333638 -1.034388
H  -4.017539 -0.768361 -0.64968
H  -3.876378 0.003217 0.959273
H  -4.342706 0.97501 -0.459181
H  2.687749 1.272266 0.427927
H  4.900883 0.112516 0.489798
H  4.096351 -1.479215 0.335177
H  3.837315 -0.495814 1.805025
H  2.358875 0.907179 -1.94103
H  3.24074 -0.538844 -1.869966
