program: Gaussian 09
title: 000216802
version: EM64L-G09RevD.01
frameworkgroup: C1[X(C19H20N4O4)]
method: RPBEPBE
basis: SDD
operation: Freq
keyword: #p
keyword: freq=noraman
keyword: PBEPBE/SDD
title: #p freq=noraman PBEPBE/SDD
converged: YES YES NO NO
title: Mulliken charges:
elementType: O O O O N N N N C C C C C C C C C C C C C C C C C C C H H H H H H H H H H H H H H H H H H H H
charge: -0.295732 -0.190333 -0.266618 -0.291128 -0.015644 0.037054 -0.176785 -0.430247 -0.584223 -0.370445 0.548258 -0.510909 -0.434015 0.232816 0.208892 -0.330552 -0.315129 0.256032 -0.549714 -0.537301 0.424998 0.069901 -0.428644 -0.309859 -0.201109 -0.219405 -0.260407 0.236869 0.232758 0.244803 0.259101 0.259953 0.224380 0.237783 0.305567 0.221397 0.240198 0.286056 0.247181 0.222676 0.223101 0.323795 0.218271 0.289686 0.223373 0.218059 0.225238
chargesum: 0.00000
title: Mulliken charges with hydrogens summed into heavy atoms:
elementType: O O O O N N N N C C C C C C C C C C C C C C C C C C C
charge: -0.295732 -0.190333 -0.266618 -0.291128 -0.015644 0.037054 -0.176785 -0.106452 -0.114595 0.133459 0.548258 -0.250956 -0.209636 0.232816 0.208892 -0.092769 -0.009562 0.256032 0.197937 0.155658 0.424998 0.069901 -0.210373 -0.020173 0.022264 -0.001346 -0.035169
polarizability: 3.85740071e+02 2.10882135e+01 2.81632274e+02 4.34209888e+01 -1.75639452e+01 1.49417969e+02
1716.lowfreq: -7.2846 -3.1361 0.0005 0.0005 0.0008 1.1515 12.2960 20.6373 24.9913
frequency: 11.8837 20.5097 24.9767 38.1814 50.1635 51.0637 66.9082 76.8152 100.1846 109.6372 116.1241 120.9673 138.8606 165.7862 180.1871 191.1063 222.3827 234.2471 243.8756 249.4617 258.6427 278.2933 308.0587 322.2984 343.2018 364.3636 371.3306 407.3561 427.4398 440.0987 460.1729 477.6406 497.3538 508.0544 538.5737 580.8692 590.7462 604.4929 609.7793 622.7734 640.6990 648.0910 656.6639 690.5113 694.7089 702.5206 715.1956 716.9412 737.5448 741.5135 756.8761 763.9663 801.0716 824.9462 838.7841 846.9656 866.9418 893.2727 907.6137 920.5764 925.1986 932.5963 938.9993 967.6784 983.9989 984.3108 987.3689 990.8568 1011.1764 1024.8063 1026.1410 1080.7387 1112.0701 1113.2754 1122.1323 1123.8083 1133.8388 1145.0138 1156.1849 1160.9838 1168.6725 1176.2206 1184.4771 1208.7702 1212.8600 1245.2679 1256.1332 1275.1897 1305.4128 1308.7220 1339.9028 1343.6108 1374.3565 1382.2476 1383.5013 1406.4504 1412.3632 1434.1300 1440.6308 1447.6438 1463.4336 1464.1793 1467.2728 1471.8877 1472.4835 1478.6681 1484.5392 1484.7831 1498.6553 1572.2225 1579.8228 1602.6433 1613.9274 1615.6489 1706.8144 2961.1546 2986.0343 2997.9414 3033.2493 3050.2660 3057.1489 3095.8705 3107.9167 3109.5489 3118.9118 3126.4227 3126.9986 3127.3653 3139.7075 3141.8902 3158.8518 3162.4294 3184.4163 3276.7522 3525.8500
redmass: 6.6279 5.1331 3.8484 6.0298 6.8356 6.7622 5.4348 4.2738 7.0733 3.8453 3.6286 5.1631 3.9055 4.4917 1.2340 3.0062 2.7870 2.0277 3.4921 4.3004 2.4541 4.1854 3.9962 3.2929 3.7946 5.5249 6.9783 2.9362 4.3205 4.8370 4.3330 4.0896 4.3282 2.8061 7.3505 7.9809 4.7312 4.8312 6.0412 5.4747 2.9971 2.7420 1.9566 4.1769 2.0241 2.1866 3.4508 3.5933 3.4124 4.1222 7.5325 1.7023 1.4604 7.5841 1.2664 3.4048 5.7299 1.7963 1.4488 1.5034 2.1736 4.6704 3.7046 1.3531 5.4528 5.9545 3.4066 1.3108 3.5633 2.2297 2.2395 1.6330 1.2629 2.2822 1.2257 2.3922 2.3310 1.7039 1.3955 1.4503 1.0616 1.4264 1.1133 1.4766 1.8653 2.2618 2.7279 1.8306 1.4518 1.7218 2.6593 1.4252 3.1188 4.7315 3.3505 2.4464 2.9263 1.1835 1.9288 1.3469 1.1923 1.9387 1.0513 1.1202 1.0676 1.7943 1.0761 2.4477 2.6396 4.4146 7.1357 3.6628 6.5629 6.0876 11.0558 1.0328 1.0301 1.0601 1.0609 1.1041 1.1021 1.1055 1.1052 1.0879 1.0891 1.0867 1.1000 1.1030 1.0932 1.0916 1.0938 1.0994 1.0946 1.0996 1.0750
irintensity: 1.1937 0.7209 0.1861 1.0566 0.0912 2.8239 0.1665 1.0777 1.2170 3.1365 14.9720 2.9605 1.2167 5.8297 0.7561 0.0546 2.2285 1.0489 2.6566 3.1344 2.2170 3.0644 2.2443 9.6084 1.2405 4.8495 7.7159 0.0198 7.1525 19.6595 7.8301 5.0948 0.7050 20.2371 42.2492 15.7607 21.5597 24.5798 4.3325 28.4975 3.5296 6.2765 44.7661 2.0668 32.1388 26.7430 57.4360 10.6378 2.8079 28.5058 24.3101 117.3221 50.1230 4.0096 1.7723 3.6780 32.9296 24.5307 12.1048 5.9745 4.6962 7.7847 25.9780 0.0390 26.6988 10.6563 19.7129 1.8952 30.5160 12.7222 1.8596 12.5908 1.5190 121.9656 5.4984 35.9471 54.6803 22.6216 6.8994 17.8239 0.1098 6.6415 3.3383 45.0079 68.4412 8.0017 158.3817 35.7083 10.6144 62.7730 436.9641 70.1181 7.8264 203.4275 391.2590 22.6243 61.2085 2.7593 28.2359 18.1917 14.5921 11.9924 13.2093 87.8641 6.4502 13.7507 26.1000 208.2783 96.3631 415.1186 14.0679 200.0300 16.6809 86.4631 1034.6486 73.2802 39.4400 27.9588 26.8142 45.5034 17.1329 11.3750 7.4013 13.9011 16.8203 1.3383 14.3080 24.6552 33.2776 8.1727 14.9421 33.5471 9.6616 9.3489 31.2640
temp: 298.150 k
press: 1.00000 atm
elementType: 8 8 8 8 7 7 7 7 6 6 6 6 6 6 6 6 6 6 6 6 6 6 6 6 6 6 6 1 1 1 1 1 1 1 1 1 1 1 1 1 1 1 1 1 1 1 1
symmnumber: 1
zpe: 953924.5 jmol-1
zpe.correction: 0.363331 hartree
zpe.thermalcorrener: 0.388636 hartree
zpe.thermalcorrenthalpy: 0.389581 hartree
zpe.thermalcorrgfe: 0.304886 hartree
zpe.sumelectzpe: -1253.857515 hartree
zpe.sumelectthermal: -1253.832209 hartree
zpe.sumelectthermalent: -1253.831265 hartree
zpe.sumelectthermalfe: -1253.915960 hartree
dipole: 3.7049 5.2549 0.3754
dipole: 6.4406
quadrupole: -129.8890 -127.6703 -167.7316
quadrupole: 7.2565 12.1886 -9.3715
quadrupole: 11.8746 14.0933 -25.9680 7.2565 12.1886 -9.3715
hfenergy: -1254.2208458 hartree
pointgroup: C01 [X(C19H20N4O4)]
dipole: 1.3995528 2.070125 0.4201592 debye
polarizability: 382.6879186|18.2925445|284.7127594|51.0734273|-0.2808162|149.3896354 unknown
InChI: InChI=1S/C19H20N4O4/c1-25-16-9-8-14(12-17(16)26-2)10-11-23-13-18(27-22-23)21-19(24)20-15-6-4-3-5-7-15/h3-9,12-13,20H,10-11H2,1-2H3
charge 0 multiplicity 1
47 atoms
O  2.616977 -1.677215 -1.645329
O  0.034043 0.4595 1.687891
O  4.837292 -2.26943 -0.008325
O  -1.138911 -2.051913 0.449604
N  0.845592 2.351725 0.913239
N  1.06796 1.434716 1.901734
N  -1.837058 0.191956 0.091569
N  -3.382596 -1.609797 0.151642
C  2.810597 3.113814 -0.453379
C  1.868167 3.410661 0.755324
C  3.425911 1.725692 -0.3801
C  2.80341 0.639508 -1.044595
C  4.55975 1.462721 0.422293
C  3.264894 -0.684198 -0.903282
C  4.412334 -0.935684 -0.084387
C  5.05181 0.146042 0.566539
C  -0.209668 2.079241 0.089103
C  -0.798622 0.854121 0.512821
C  2.001171 -2.799414 -0.883762
C  6.028351 -2.556686 0.79499
C  -4.615487 -0.937864 -0.059034
C  -2.052559 -1.180036 0.266713
C  -5.789592 -1.745194 -0.066604
C  -4.741309 0.462913 -0.263229
C  -7.057795 -1.167169 -0.2706
C  -6.018731 1.027538 -0.466272
C  -7.184419 0.22741 -0.471692
H  3.588562 3.900574 -0.438158
H  2.24177 3.237287 -1.393384
H  1.352198 4.378602 0.632498
H  2.4390 3.421701 1.698082
H  1.927682 0.791079 -1.68583
H  5.066516 2.283344 0.945092
H  5.936284 -0.028899 1.186506
H  -0.489085 2.7059 -0.749288
H  1.613729 -3.47894 -1.657801
H  2.759476 -3.312015 -0.268637
H  1.165976 -2.424197 -0.264717
H  6.177092 -3.642621 0.705622
H  6.915585 -2.02469 0.400098
H  5.872769 -2.286507 1.857526
H  -3.444223 -2.626516 0.254382
H  -5.703879 -2.828784 0.089299
H  -3.840783 1.079333 -0.265844
H  -7.947112 -1.807524 -0.271642
H  -6.10061 2.109679 -0.622413
H  -8.169862 0.678635 -0.628665
