program: Gaussian 09
title: 000216697
version: EM64L-G09RevD.01
frameworkgroup: C1[X(C12H23N)]
method: RPBEPBE
basis: SDD
operation: Freq
keyword: #pfreq=noraman
keyword: PBEPBE/SDD
title: #p freq=noraman PBEPBE/SDD
converged: YES YES NO NO
title: Mulliken charges:
elementType: N C C C C C C C C C C C C H H H H H H H H H H H H H H H H H H H H H H H
charge: -0.558696 0.258289 -0.506112 0.174943 0.302625 -0.573421 -0.577319 -0.743288 -0.768996 -0.100136 -0.849423 -0.353457 -0.701248 0.212037 0.210029 0.216240 0.220534 0.230061 0.189586 0.229549 0.206466 0.210778 0.217478 0.213629 0.213045 0.200660 0.226457 0.233963 0.223077 0.180831 0.217858 0.251740 0.264294 0.196171 0.220795 0.210963
chargesum: 0.00000
title: Mulliken charges with hydrogens summed into heavy atoms:
elementType: N C C C C C C C C C C C C
charge: -0.042662 0.258289 -0.084046 0.174943 0.302625 -0.136647 -0.157672 -0.096496 -0.124845 0.100524 -0.165926 0.045231 -0.073319
polarizability: 1.59731881e+02 -9.26676211e+00 1.24430666e+02 -2.12923517e+00 4.54668782e+00 1.21669127e+02
1716.lowfreq: -13.7210 -7.9539 -0.0008 -0.0007 -0.0002 5.3612 22.8819 46.1383 57.1546
frequency: 16.2515 45.7981 56.6997 90.5858 114.8945 150.3485 171.2821 211.1813 217.5082 227.8531 234.6126 240.8103 253.4716 274.1760 288.4687 319.5511 333.8226 362.9150 390.3343 420.8768 460.2455 503.3906 551.0499 585.5705 624.0870 640.3461 662.3063 754.3099 773.9140 806.5965 852.1539 881.5543 917.2823 925.3514 942.3068 961.0413 972.1139 988.9669 1002.9021 1016.2018 1029.4426 1042.8323 1059.5853 1083.7856 1104.9121 1119.4461 1130.1901 1142.1522 1190.9078 1198.9069 1210.8651 1230.4587 1248.2622 1264.2365 1273.9135 1290.9221 1299.3704 1313.0446 1326.8775 1334.5288 1362.9489 1368.5373 1385.4313 1387.2816 1396.2278 1454.6124 1457.2540 1459.3637 1462.1974 1464.9341 1469.1923 1475.4269 1477.3898 1478.5266 1480.8158 1484.6320 1486.4788 1634.7467 1682.2676 2954.4126 2955.1807 2959.6675 2961.7155 2963.4179 2967.5316 2967.9853 2979.0498 2989.8276 3014.0185 3017.0394 3023.9772 3025.5200 3052.8515 3057.7392 3059.7729 3061.6127 3065.4006 3069.8144 3070.4754 3077.5661 3421.7487 3550.0817
redmass: 2.9204 3.1924 2.1625 2.8218 2.3051 1.0732 2.1854 1.6011 1.1598 1.3056 1.2746 2.5578 1.1626 2.0382 2.3672 2.2014 2.3526 2.2118 2.9080 1.8976 2.2008 2.6258 3.2827 2.8673 2.7984 1.6554 3.4324 1.6335 1.8217 1.6129 2.1114 1.8871 1.6586 1.4996 1.6287 1.8204 1.5412 1.5401 1.5958 1.7498 1.5371 1.7010 2.5741 1.7271 1.6788 2.0175 1.8350 2.1541 1.8036 1.8787 2.1101 1.6093 1.5928 1.3855 2.4790 1.2825 1.5229 1.5083 2.0176 1.6181 1.3471 1.2031 1.2206 1.2493 1.2461 1.0777 1.0675 1.0865 1.0520 1.0619 1.0757 1.0849 1.0480 1.0591 1.0600 1.0511 1.0611 1.0949 7.8133 1.0642 1.0623 1.0395 1.0592 1.0349 1.0358 1.0366 1.0807 1.0659 1.0907 1.0989 1.0997 1.0963 1.1021 1.1006 1.0999 1.0987 1.1000 1.0986 1.0994 1.0955 1.0446 1.0961
irintensity: 0.2465 0.3668 0.0516 0.3585 0.4065 0.4224 0.5989 2.0041 10.7180 27.4906 1.1708 0.4262 0.1242 0.1956 11.5894 3.9139 10.2788 10.8373 4.6050 14.9627 1.9244 12.3310 1.3299 7.9399 47.4225 184.4179 0.7314 1.8892 3.3246 4.6741 3.2838 0.5132 2.0276 4.7495 1.5731 4.7790 5.9756 1.3046 3.5048 1.1809 2.1063 1.2029 1.9136 6.4797 10.9494 21.9382 18.4796 8.1821 2.8125 3.3727 3.1047 1.6334 2.3002 4.5532 0.5280 4.2558 2.9806 1.8020 9.5148 3.3258 12.4109 20.6188 11.9963 8.3365 14.5546 8.0076 2.6025 1.0730 4.2392 12.4567 9.1984 11.5125 14.7986 4.3016 11.7457 11.0166 5.9984 32.3530 0.3375 33.6877 23.6774 32.4940 38.3058 33.2054 81.2011 4.7295 36.7112 29.7932 36.3296 12.9717 46.1553 25.2214 16.8027 1.9172 66.3283 87.7820 66.1840 35.1445 45.7573 37.3104 4.0803 0.3240
temp: 298.150 k
press: 1.00000 atm
elementType: 7 6 6 6 6 6 6 6 6 6 6 6 6 1 1 1 1 1 1 1 1 1 1 1 1 1 1 1 1 1 1 1 1 1 1 1
symmnumber: 1
zpe: 850978.2 jmol-1
zpe.correction: 0.324120 hartree
zpe.thermalcorrener: 0.340385 hartree
zpe.thermalcorrenthalpy: 0.341330 hartree
zpe.thermalcorrgfe: 0.280412 hartree
zpe.sumelectzpe: -524.750776 hartree
zpe.sumelectthermal: -524.734511 hartree
zpe.sumelectthermalent: -524.733567 hartree
zpe.sumelectthermalfe: -524.794485 hartree
dipole: 0.2670 1.2357 0.0966
dipole: 1.2679
quadrupole: -79.2043 -87.4824 -81.0292
quadrupole: 3.7037 0.7961 1.9133
quadrupole: 3.3676 -4.9104 1.5428 3.7037 0.7961 1.9133
hfenergy: -525.0748969 hartree
pointgroup: C01 [X(C12H23N1)]
dipole: 0.1072815 0.41165 0.2604799 debye
polarizability: 159.6585573|-7.4812763|120.1793841|-6.1071772|3.7352755|125.9937333 unknown
InChI: InChI=1S/C12H23N/c1-5-11(13)8-10-6-7-12(3,4)9(10)2/h11H,5-8,13H2,1-4H3
charge 0 multiplicity 1
36 atoms
N  3.63844 -1.284487 -0.058541
C  -2.365651 0.269651 -0.18551
C  -1.841702 0.200147 -1.660131
C  -1.09994 -0.098299 0.62184
C  -0.142836 -0.66835 -0.171926
C  -0.615042 -0.751967 -1.624055
C  1.193421 -1.248549 0.23181
C  -3.47501 -0.797268 0.058166
C  -2.921006 1.675104 0.154725
C  2.429973 -0.451548 -0.283951
C  -1.0513 0.112064 2.115618
C  2.496306 0.970409 0.346432
C  3.634056 1.842649 -0.22505
H  -1.510725 1.209802 -1.970806
H  -2.625945 -0.128177 -2.366566
H  0.166349 -0.458113 -2.351139
H  -0.893203 -1.797655 -1.875474
H  1.295309 -2.273911 -0.176854
H  1.271262 -1.334645 1.335272
H  -3.129212 -1.803092 -0.243406
H  -3.762642 -0.842971 1.12566
H  -4.384111 -0.553935 -0.524507
H  -2.136153 2.44791 0.052693
H  -3.750094 1.938767 -0.529436
H  -3.314812 1.719961 1.187791
H  2.331161 -0.334189 -1.382792
H  -1.904214 -0.384252 2.620357
H  -1.116194 1.187634 2.37358
H  -0.121997 -0.280779 2.562607
H  2.619236 0.862414 1.445328
H  1.522874 1.474781 0.185566
H  3.791016 -1.501331 0.934945
H  4.489112 -0.900438 -0.485419
H  4.626356 1.387841 -0.039868
H  3.640839 2.847169 0.236013
H  3.520884 1.975353 -1.318371
