program: Gaussian 09
title: 000216678
version: EM64L-G09RevD.01
frameworkgroup: C1[X(C8H9N3OS)]
method: RPBEPBE
basis: SDD
operation: Freq
keyword: #p
keyword: freq=noraman
keyword: PBEPBE/SDD
title: #p freq=noraman PBEPBE/SDD
converged: YES YES NO NO
title: Mulliken charges:
elementType: S O N N N C C C C C C C C H H H H H H H H H
charge: 0.294164 -0.258906 -0.072140 0.000187 -0.610433 0.369636 -0.539404 -0.793748 0.176517 -0.261918 0.086368 -0.286474 -0.514059 0.250553 0.301200 0.261026 0.253106 0.316567 0.329964 0.235515 0.234920 0.227362
chargesum: 0.00000
title: Mulliken charges with hydrogens summed into heavy atoms:
elementType: S O N N N C C C C C C C C
charge: 0.294164 -0.258906 -0.072140 0.000187 0.036098 0.369636 -0.539404 -0.241995 0.176517 -0.000892 0.086368 -0.033369 0.183737
polarizability: 2.19609575e+02 -6.03904115e+00 1.27537580e+02 3.69368165e-01 9.34079004e-01 6.29613021e+01
1716.lowfreq: -8.5861 -5.7136 -4.0964 0.0017 0.0018 0.0024 58.5997 110.4125 119.0859
frequency: 58.5963 110.4112 119.0843 150.4078 158.9590 179.9855 227.6323 280.1260 338.0005 350.8815 379.2161 391.6280 407.4007 434.9545 474.7601 522.4936 538.5453 589.6663 613.1522 626.2541 655.1469 722.0603 755.4746 780.1173 830.7094 843.2908 879.2378 900.2319 961.0066 978.7499 1024.3071 1077.5853 1113.8220 1117.4684 1147.7998 1156.5127 1243.5453 1252.9395 1278.0411 1316.6758 1357.0752 1383.7161 1404.2982 1433.1032 1446.0854 1449.5413 1466.9013 1530.4608 1578.5605 1596.9164 1636.3033 2995.2438 3023.7936 3093.8778 3106.1781 3135.5111 3160.6605 3187.2994 3539.1620 3698.8073
redmass: 4.4930 2.8310 3.3892 1.4738 2.5997 5.1603 5.5335 4.0865 3.8383 2.1196 2.2647 4.8724 3.8519 5.1148 4.2205 2.0156 4.0044 3.7772 2.2764 4.0482 8.4362 5.5329 7.0966 6.5405 1.6019 4.8112 3.7950 1.7813 1.3571 7.2943 3.0969 1.8472 1.2551 1.3855 1.2848 1.2665 1.2513 2.2425 4.8580 5.5063 6.8802 2.8827 2.7917 1.1446 1.5358 1.0635 1.0561 6.1179 6.6500 1.6801 2.8631 1.0294 1.0593 1.1040 1.1052 1.1044 1.0896 1.0975 1.0456 1.1038
irintensity: 4.1022 1.1658 4.6977 2.1230 4.5018 7.3643 1.3145 5.3024 23.5049 67.1530 53.4356 6.9223 15.9723 4.8767 15.2972 58.2951 7.6918 29.2127 59.6457 4.8186 3.9399 13.0097 1.1780 6.3883 52.5425 29.5169 7.0249 4.4783 1.6309 81.5154 16.2051 44.7497 0.2609 5.8697 4.6999 7.4276 14.2540 187.2098 20.5454 20.7191 55.2640 315.3324 28.4833 21.7483 84.5906 14.7776 37.6904 74.3105 25.2464 44.3875 679.5423 60.2134 31.4474 33.3304 7.3607 29.6124 4.1339 6.4254 109.9327 37.9356
temp: 298.150 k
press: 1.00000 atm
elementType: 16 8 7 7 7 6 6 6 6 6 6 6 6 1 1 1 1 1 1 1 1 1
symmnumber: 1
zpe: 431913.9 jmol-1
zpe.correction: 0.164507 hartree
zpe.thermalcorrener: 0.176479 hartree
zpe.thermalcorrenthalpy: 0.177423 hartree
zpe.thermalcorrgfe: 0.126506 hartree
zpe.sumelectzpe: -946.834763 hartree
zpe.sumelectthermal: -946.822791 hartree
zpe.sumelectthermalent: -946.821847 hartree
zpe.sumelectthermalfe: -946.872764 hartree
dipole: 3.9478 -0.5176 0.9272
dipole: 4.0882
quadrupole: -56.1539 -81.9565 -85.1350
quadrupole: 0.8676 1.6356 -1.1569
quadrupole: 18.2612 -7.5414 -10.7199 0.8676 1.6356 -1.1569
hfenergy: -946.9992702 hartree
pointgroup: C01 [X(C8H9N3O1S1)]
dipole: -1.5474514 0.236004 0.3696711 debye
dipolederiv: -0.2520853 0.2347932 -0.0328871 0.3478956 -0.2495749 -0.0725466 -0.0919705 0.0053603 -0.0381829 -1.8837556 -0.4206218 0.0345095 -0.4944434 -0.5278245 0.0165557 0.0410336 0.0195336 -0.3158614 -1.3586397 0.0364043 -0.0926133 0.4984427 -0.4862633 -0.0082724 0.0220098 -0.0584304 -0.2988144 -1.0862458 0.0186828 0.0157783 0.3229783 -0.348256 -0.0023114 -0.0110903 -0.0133222 -0.1623023 -1.8042968 -0.0393012 -0.0555712 -0.3395427 -0.2753842 0.1546869 -0.2612366 0.155406 -0.646203 0.7555536 0.0626442 0.10157 0.3735057 -0.3986255 0.0202645 0.1042794 0.0924862 0.0533875 0.5505438 -0.2984828 0.023835 -0.6984145 0.6461651 -0.0037061 0.0971671 -0.0152752 -0.066387 0.1343499 -0.0120574 -0.080844 -0.1049638 -0.1428845 -0.0998489 -0.1609299 -0.1109296 0.1434378 2.0577923 -0.1223686 0.1637184 -0.2146483 0.4981122 0.1080545 0.2957613 0.1277682 0.1884774 0.3094778 -0.1825617 -0.0008208 0.0339245 0.2019841 -0.0042862 -0.0683436 -0.0370127 -0.1315764 1.9632401 0.320534 -0.0358023 0.2580949 0.2278144 -0.0183214 -0.0263499 -0.0211312 0.1391003 -0.4861154 0.0397273 0.0200949 -0.4835395 -0.0597654 -0.0107373 0.053153 -0.0028276 -0.1618831 0.5620988 0.1594558 -0.0149314 0.5321469 0.5036618 -0.0191249 -0.0511221 -0.0210641 0.2815198 -0.0804203 0.1034989 0.0136226 0.0810834 0.011711 -0.0042904 -0.0051568 0.0084578 0.1056525 0.0590137 -0.0232999 -0.0150674 -0.0376279 0.05819 0.0755331 0.0666038 -0.0062234 -0.0882267 0.0770993 -0.0719833 0.0001131 -0.0411039 -0.0369552 0.009967 0.0005036 0.0034202 0.1496723 0.0280916 0.0878506 -0.0098776 0.0946323 0.0081887 0.0141127 -0.0050421 0.0220711 0.1758677 0.2730344 0.0208333 -0.0162654 -0.022217 0.1634631 -0.0792118 -0.0083052 -0.0666922 0.3429007 0.2211867 0.0303234 -0.0123823 0.0975609 0.1846326 -0.0732975 -0.0088097 -0.0789842 0.3488882 0.0800436 0.0498793 0.0746322 -0.1128739 -0.0437858 -0.0720501 0.0348831 -0.0966954 -0.0543777 0.0817464 0.0344665 -0.0816583 -0.1163631 -0.0146013 0.0649651 -0.0123856 0.0905265 -0.0853808 -0.2017132 -0.0284167 0.0008471 0.0254728 0.0799977 0.0038654 -0.0046521 0.0035582 0.1202913 unknown
polarizability: 219.3374718|-7.8147014|127.788265|-0.9887637|-1.3413687|62.9827203 unknown
InChI: InChI=1S/C8H9N3OS/c1-12-7-3-2-5-8(11-7)13-4-6(9)10-5/h2-3H,4,9H2,1H3
charge 0 multiplicity 1
22 atoms
S  -1.040167 2.069359 -0.180888
O  3.5485 -0.119131 0.042351
N  -1.972103 -0.980113 -0.153856
N  1.353522 0.77503 -0.039699
N  -4.193499 -0.283481 -0.218303
C  -0.594372 -0.722769 0.012983
C  0.01559 0.567498 -0.039971
C  -2.538899 1.315386 0.69402
C  -2.864245 -0.03646 0.072066
C  0.300452 -1.82873 0.126618
C  2.17003 -0.300038 0.050148
C  1.688379 -1.632679 0.155439
C  4.030632 1.270251 -0.080524
H  -3.354318 2.047923 0.588198
H  -2.288295 1.196474 1.762114
H  -0.132679 -2.8324 0.170601
H  2.395977 -2.460559 0.237862
H  -4.919785 0.405358 -0.046227
H  -4.436389 -1.185449 -0.626391
H  3.667688 1.885663 0.760561
H  3.683521 1.721696 -1.025947
H  5.126959 1.18187 -0.063357
