program: Gaussian 09
title: 000211506
version: EM64L-G09RevD.01
frameworkgroup: C1[X(C10H19Cl2O4P)]
method: RPBEPBE
basis: SDD
operation: Freq
keyword: #p
keyword: freq=noraman
keyword: PBEPBE/SDD
title: #p freq=noraman PBEPBE/SDD
converged: YES YES NO NO
title: Mulliken charges:
elementType: Cl Cl P O O O O C C C C C C C C C C H H H H H H H H H H H H H H H H H H H
charge: 0.035214 0.033963 1.413459 -0.511048 -0.510258 -0.495582 -0.588117 -0.358269 -0.363802 -0.353616 -0.393570 -0.354776 -0.274132 -0.695240 -0.479947 0.117316 -0.349946 0.191031 0.181960 0.188578 0.224760 0.191744 0.188519 0.203472 0.224493 0.193304 0.195304 0.243785 0.232048 0.210078 0.215028 0.211158 0.248521 0.247783 0.246820 0.289966
chargesum: 0.00000
title: Mulliken charges with hydrogens summed into heavy atoms:
elementType: Cl Cl P O O O O C C C C C C C C C C
charge: 0.035214 0.033963 1.413459 -0.511048 -0.510258 -0.495582 -0.588117 0.014722 0.049536 0.026647 0.034394 0.033832 0.201701 -0.058975 0.263177 0.407281 -0.349946
polarizability: 1.75917292e+02 -1.87499157e+01 1.78476051e+02 -9.76102023e+00 -9.82327707e+00 1.46730777e+02
1716.lowfreq: -10.9574 -5.7612 0.0019 0.0026 0.0028 4.8672 5.8676 14.4544 21.7806
frequency: -3.2197 13.8456 21.5294 31.1934 34.3815 49.4665 57.7659 72.8140 82.8196 97.3501 104.6567 105.7246 124.9873 134.7505 157.1287 171.7585 215.1710 229.0028 231.5123 234.8503 246.0904 278.2517 293.9228 324.2309 336.9396 377.0941 404.0128 414.4574 436.2555 440.2114 513.0517 567.6117 628.0720 665.2903 701.5350 722.1108 740.3469 786.3162 832.3707 852.9486 868.8211 873.8321 895.3055 905.0992 966.1579 975.4677 1000.8731 1038.8351 1057.5506 1070.6773 1074.9927 1078.6694 1084.3437 1114.9257 1121.9252 1131.6842 1139.6075 1192.4657 1206.6402 1239.6697 1251.2721 1278.8496 1279.7949 1284.3679 1291.2616 1295.4915 1334.0755 1353.5620 1360.4711 1365.0111 1390.3044 1425.7869 1443.7349 1461.4357 1462.4954 1464.4759 1470.0202 1473.1670 1474.2409 1477.4366 1481.5427 1488.0485 1651.1967 2949.0839 2955.3315 2964.3022 2967.6781 2972.1059 2973.1118 2987.9218 2994.4055 3002.3622 3003.0445 3023.1998 3032.6481 3052.3821 3068.4395 3070.7442 3082.8697 3101.3472 3139.8438 3143.0837
redmass: 5.7792 4.6291 8.4801 5.3663 1.8000 3.9444 3.3280 4.3192 3.1188 3.1799 1.4364 1.7413 2.8048 2.7273 14.6576 4.7092 4.4869 1.1789 5.9130 2.5019 3.5505 9.4439 9.5538 6.8492 4.4636 12.2445 3.8308 5.0260 4.5258 5.0192 3.2581 8.4506 7.2000 10.4573 2.8456 1.0878 1.2876 1.4126 1.3537 1.6132 3.2168 6.0597 2.2946 1.5309 9.2099 1.4924 3.0454 1.9759 2.7392 8.3302 2.8863 4.9834 2.1036 1.2480 2.4707 1.2950 1.7163 1.5349 1.2840 1.3069 1.2839 1.1120 1.1518 1.1099 1.1792 1.1771 1.4111 1.6038 1.3007 1.6159 1.2173 1.1223 1.0808 1.0499 1.0670 1.0760 1.0529 1.0737 1.0870 1.0423 1.0811 1.0878 8.5442 1.0591 1.0591 1.0620 1.0608 1.0364 1.0630 1.0959 1.0292 1.0619 1.0978 1.0970 1.1017 1.1022 1.1006 1.0993 1.1087 1.1064 1.1037 1.0929
irintensity: 0.0325 0.8269 0.3637 0.4160 0.3533 6.3633 2.1969 0.1960 2.2042 1.2965 0.7367 0.1469 0.5783 0.2937 0.9309 4.1845 2.8219 0.4461 0.8509 5.0795 0.0603 5.5290 19.8219 3.4587 9.3209 46.5197 13.2909 31.4345 26.3425 12.1454 4.2120 4.6402 36.0492 207.4314 72.3405 17.4921 14.1252 20.4250 25.3474 27.0060 50.0535 214.7674 95.6575 28.8153 278.6362 21.5138 3.4705 34.1526 8.6636 124.5490 92.3722 214.9018 14.9803 1.8303 5.5735 1.0585 2.4543 1.1207 6.4571 1.2483 1.6289 0.5601 16.8833 0.4962 0.3838 2.6620 0.0858 1.0082 8.6501 0.7472 11.1824 1.2849 7.4069 13.3984 0.0145 0.4245 16.0577 1.3905 13.2257 12.5548 3.4500 23.2661 12.8188 7.2170 3.4952 5.3459 83.3609 38.7100 55.7678 6.5060 41.2853 19.6117 3.7333 16.1339 20.3022 76.7017 93.6334 55.4436 26.0742 22.2284 10.6669 25.7023
temp: 298.150 k
press: 1.00000 atm
elementType: 17 17 15 8 8 8 8 6 6 6 6 6 6 6 6 6 6 1 1 1 1 1 1 1 1 1 1 1 1 1 1 1 1 1 1 1
symmnumber: 1
zpe: 738761.8 jmol-1
zpe.correction: 0.281379 hartree
zpe.thermalcorrener: 0.303483 hartree
zpe.thermalcorrenthalpy: 0.304428 hartree
zpe.thermalcorrgfe: 0.225281 hartree
zpe.sumelectzpe: -1953.261861 hartree
zpe.sumelectthermal: -1953.239757 hartree
zpe.sumelectthermalent: -1953.238812 hartree
zpe.sumelectthermalfe: -1953.317960 hartree
dipole: 0.8605 -1.3620 2.7429
dipole: 3.1810
quadrupole: -108.9654 -127.3996 -130.8100
quadrupole: -1.0258 4.7243 -8.5941
quadrupole: 13.4262 -5.0079 -8.4183 -1.0258 4.7243 -8.5941
hfenergy: -1953.5432401 hartree
pointgroup: C01 [X(C10H19Cl2O4P1)]
dipole: -0.3631386 -0.4787049 -1.0978495 debye
polarizability: 177.6042202|19.1355476|175.9578416|-8.6076169|11.3507712|147.5620581 unknown
InChI: InChI=1S/C10H19Cl2O4P/c1-3-4-5-6-7-8-15-17(13,14-2)16-9-10(11)12/h9H,3-8H2,1-2H3
charge 0 multiplicity 1
36 atoms
Cl -0.926446 4.383341 0.83158
Cl -0.70115 2.764018 -1.744826
P  -2.47231 -0.842482 0.661709
O  -1.004064 -1.625581 0.332274
O  -3.543226 -1.628771 -0.42029
O  -2.36316 0.721154 -0.187474
O  -2.852039 -0.697405 2.189789
C  3.330615 -1.290547 -0.385247
C  1.827751 -0.939428 -0.450281
C  4.203462 -0.131393 0.14607
C  0.970175 -2.101376 -0.997191
C  5.705872 -0.486341 0.225789
C  -0.519593 -1.780063 -1.090004
C  6.573202 0.679385 0.748183
C  -4.965506 -1.201431 -0.458118
C  -1.999372 1.865244 0.537317
C  -1.294559 2.858432 -0.052808
H  3.470553 -2.180658 0.263425
H  3.687175 -1.582729 -1.395876
H  1.68524 -0.043044 -1.089804
H  1.466055 -0.668824 0.560201
H  3.844346 0.167198 1.153006
H  4.072185 0.757382 -0.506071
H  1.310036 -2.373264 -2.018778
H  1.102849 -3.003108 -0.368532
H  6.061927 -0.792393 -0.779403
H  5.836267 -1.369893 0.88371
H  -1.103337 -2.597776 -1.546785
H  -0.704437 -0.833879 -1.633355
H  6.485437 1.564491 0.089992
H  7.641774 0.399945 0.798151
H  6.255893 0.985208 1.763074
H  -5.443256 -1.902019 -1.15768
H  -5.042734 -0.167312 -0.836046
H  -5.423389 -1.287558 0.542712
H  -2.332032 1.936175 1.579988
