program: Gaussian 09
title: 000216754
version: EM64L-G09RevD.01
frameworkgroup: C1[X(C22H26N2O3)]
method: RPBEPBE
basis: SDD
operation: Freq
keyword: #p
keyword: freq=noraman
keyword: PBEPBE/SDD
title: #p freq=noraman PBEPBE/SDD
converged: YES YES NO NO
title: Mulliken charges:
elementType: O O O N N C C C C C C C C C C C C C C C C C C C C C C H H H H H H H H H H H H H H H H H H H H H H H H H H
charge: -0.288220 -0.422124 -0.244747 -0.080574 -0.130160 -0.363475 -0.374667 -0.430728 -0.569661 0.170448 -0.412563 0.359324 -0.365415 0.340765 -0.453544 -0.697075 -0.412739 -0.403699 -0.252215 0.494608 -0.249752 0.173287 -0.399980 -0.414692 -0.245868 -0.267006 -0.241339 0.196701 0.209749 0.259696 0.205294 0.272868 0.208495 0.205179 0.204231 0.257238 0.216358 0.228782 0.223676 0.281281 0.269505 0.207108 0.231416 0.238976 0.244037 0.229476 0.229711 0.246386 0.226062 0.244526 0.228786 0.243242 0.373038
chargesum: 0.00000
title: Mulliken charges with hydrogens summed into heavy atoms:
elementType: O O O N N C C C C C C C C C C C C C C C C C C C C C C
charge: -0.288220 -0.049087 -0.244747 -0.080574 -0.130160 0.042974 0.090323 0.050635 -0.160251 0.170448 0.061033 0.359324 0.087043 0.340765 0.097241 -0.258552 -0.173764 -0.159662 -0.022739 0.494608 -0.020041 0.173287 -0.153594 -0.188630 -0.001343 -0.038220 0.001904
polarizability: 2.77431741e+02 -1.36881367e+01 2.19068824e+02 3.28509942e+01 -5.60563614e-01 2.37591379e+02
1716.lowfreq: -18.8465 -2.3178 -0.0008 -0.0005 -0.0002 5.0719 10.4915 21.2804 30.6083
frequency: -12.3937 21.0342 30.5899 32.7373 43.5228 50.1662 51.2357 61.1810 73.4150 89.7561 106.1542 115.1178 143.9848 153.2451 163.5465 174.3262 196.9793 241.0558 249.1518 260.0885 307.3811 325.8577 348.7556 352.4920 394.1995 398.2265 404.8908 429.1411 434.7686 456.8537 464.0249 471.6226 498.2114 507.3893 536.0461 559.3577 579.1822 599.1454 606.8054 615.4392 624.4372 638.0510 652.8594 683.9908 701.6458 728.7314 742.1542 754.1715 781.6743 783.9865 805.9716 816.8915 836.7084 852.4502 861.1756 887.7272 892.9992 899.9139 916.7349 943.4509 949.3128 957.0973 965.9221 979.6030 987.8045 989.2687 990.6355 992.9401 1004.6915 1028.2542 1039.7498 1044.9498 1051.0407 1080.9427 1083.4223 1087.8243 1097.8315 1107.2443 1135.2037 1150.5512 1163.3373 1173.5894 1176.0503 1181.8728 1185.1358 1191.8991 1192.9947 1209.4353 1212.1553 1228.4698 1239.6644 1242.0617 1251.4794 1265.6054 1277.4946 1279.9300 1286.2068 1302.2257 1321.8836 1327.1930 1335.4549 1337.7779 1348.8737 1360.6452 1378.8557 1379.9267 1382.9906 1386.5682 1423.8517 1431.0850 1435.7482 1440.9055 1450.8683 1452.6399 1453.9970 1464.4765 1465.0064 1477.4372 1482.5924 1484.9077 1487.0362 1587.5545 1588.1240 1590.7697 1610.4070 1614.1110 1660.9360 2833.7569 2841.9749 2856.2656 2965.2546 2975.1374 2987.2224 2998.9091 3006.2812 3009.4099 3022.6705 3031.1929 3039.1079 3041.7489 3055.4133 3062.6427 3075.5684 3105.7510 3112.9903 3117.2554 3122.6884 3134.4594 3138.4357 3145.4590 3160.4474 3160.8501 3507.8238
redmass: 4.2473 5.7489 9.1316 7.3380 4.5625 5.0941 4.9087 5.3856 4.8101 3.7433 2.3534 3.1969 4.1313 3.4868 3.6223 3.9971 3.2894 3.5910 4.8522 4.0387 4.1586 2.2046 2.7974 2.1310 2.4151 3.0845 2.8934 4.2784 3.9793 3.4171 3.5112 3.3476 2.9123 1.9953 3.7490 5.0545 4.3113 3.6113 3.9514 5.7191 5.4124 1.3410 3.1995 3.1114 2.7223 1.9069 2.2225 1.6518 1.9834 2.1392 2.9742 2.6290 2.1806 2.9692 1.2530 1.4917 1.7141 2.8861 2.5705 1.7557 1.8862 1.5544 2.0973 1.3756 2.0065 5.5510 1.3571 2.1038 1.3011 2.2869 2.3194 2.5197 2.2977 2.0403 1.6611 2.4885 2.1834 2.4079 2.5742 1.5457 2.0018 1.1326 1.0873 2.0901 1.3120 1.1417 1.2121 1.8830 1.5446 1.9854 1.5279 1.6122 1.3456 1.6812 1.5685 1.6452 1.2032 1.3678 1.5093 1.3568 1.3132 1.4157 1.5621 1.3226 3.2773 2.2227 3.7131 1.8969 1.8630 1.0922 2.0895 2.1859 1.1280 1.1188 1.1406 1.0941 1.1011 1.2297 1.2741 2.1168 2.0899 6.6344 7.0389 5.9865 6.0703 6.2025 7.9585 1.0712 1.0712 1.0703 1.0634 1.0584 1.0624 1.0627 1.0608 1.0867 1.0949 1.1027 1.0901 1.0988 1.0858 1.1005 1.0997 1.0877 1.0869 1.0893 1.0860 1.0917 1.0924 1.0949 1.1009 1.1007 1.0639
irintensity: 1.0498 0.2684 0.8996 0.6038 0.6537 1.9989 0.8345 0.5606 0.3716 0.7202 1.1547 4.3419 0.5009 0.9225 2.1127 0.7352 4.4177 4.2437 2.7961 1.6653 2.3690 1.4993 9.4445 2.2165 2.1475 3.7366 0.3652 20.3429 6.9813 3.3053 2.5347 7.8234 7.3734 27.7856 3.1152 4.0430 28.1030 2.3405 8.9504 1.3836 2.0160 144.9249 3.1158 7.1100 15.4547 62.5134 31.9803 51.2013 1.4063 55.2804 9.8764 8.2698 4.2454 2.4266 1.2679 1.8990 0.2962 15.9347 7.4954 3.3846 5.5617 7.6372 6.5613 0.5023 4.1586 0.5548 0.4688 21.9758 0.3182 7.5506 77.6810 100.3766 13.4580 24.0791 3.3976 1.7322 17.5814 39.5337 49.4833 0.9247 11.5787 1.3899 0.0413 2.0495 0.9347 1.2637 5.7255 4.2458 27.3441 8.3236 17.5263 12.3537 9.5170 35.4432 3.0919 6.2484 9.5648 1.6212 26.8167 54.9933 1.5654 27.2004 5.6376 2.4367 11.1782 24.1831 1.8524 0.1601 57.0010 21.0463 4.4831 8.0124 17.5181 12.4318 16.4454 14.7812 3.7681 38.9938 18.0135 26.2099 9.2325 14.2825 203.5518 2.2296 14.4696 4.5893 173.6443 45.2672 43.2421 224.8728 27.2602 25.8102 30.6415 30.7826 22.9960 18.1771 17.3353 30.8975 30.4138 13.8226 5.2993 13.3080 23.3062 11.5106 14.4877 3.4845 0.5219 15.9686 24.2622 21.6602 31.5084 15.6429 20.3258
temp: 298.150 k
press: 1.00000 atm
elementType: 8 8 8 7 7 6 6 6 6 6 6 6 6 6 6 6 6 6 6 6 6 6 6 6 6 6 6 1 1 1 1 1 1 1 1 1 1 1 1 1 1 1 1 1 1 1 1 1 1 1 1 1 1
symmnumber: 1
zpe: 1147266.9 jmol-1
zpe.correction: 0.436971 hartree
zpe.thermalcorrener: 0.461353 hartree
zpe.thermalcorrenthalpy: 0.462297 hartree
zpe.thermalcorrgfe: 0.380792 hartree
zpe.sumelectzpe: -1187.140572 hartree
zpe.sumelectthermal: -1187.116190 hartree
zpe.sumelectthermalent: -1187.115246 hartree
zpe.sumelectthermalfe: -1187.196751 hartree
dipole: -2.1912 -0.0991 3.2231
dipole: 3.8987
quadrupole: -159.7608 -159.1330 -152.8226
quadrupole: -0.4918 1.6179 14.3422
quadrupole: -2.5220 -1.8942 4.4162 -0.4918 1.6179 14.3422
hfenergy: -1187.5775429 hartree
pointgroup: C01 [X(C22H26N2O3)]
dipole: -0.8409563 0.0223302 1.282577 debye
polarizability: 275.6145107|-19.0928578|222.0400984|31.8089069|-3.350633|236.4373349 unknown
InChI: InChI=1S/C22H26N2O3/c25-21-17-23(13-14-24(21)12-6-11-22(26)27)16-20-10-5-4-9-19(20)15-18-7-2-1-3-8-18/h1-5,7-10,26H,6,11-17H2
charge 0 multiplicity 1
53 atoms
O  1.451068 2.757603 -1.686599
O  3.758383 -1.883492 -2.46958
O  4.973448 -1.829891 -0.49562
N  -0.962322 1.643616 0.892566
N  1.814459 2.102114 0.523662
C  -0.15086 2.072954 2.045405
C  1.293402 1.606135 1.818628
C  -0.523683 2.306797 -0.350708
C  -2.430277 1.721932 1.094864
C  0.993969 2.388194 -0.556648
C  3.283503 2.178535 0.355153
C  -3.202905 0.876135 0.08826
C  3.963267 0.799225 0.18737
C  -3.258355 -0.548897 0.179817
C  3.486849 0.068033 -1.081201
C  -2.578135 -1.332378 1.295524
C  -3.891479 1.529012 -0.965026
C  -4.004335 -1.261704 -0.794108
C  -4.622123 0.805761 -1.93319
C  -1.140158 -1.803893 1.036299
C  -4.677771 -0.602497 -1.846168
C  4.161586 -1.271172 -1.268204
C  -0.610788 -1.961018 -0.267888
C  -0.323637 -2.152788 2.143781
C  0.70292 -2.448425 -0.460742
C  0.987857 -2.643373 1.956632
C  1.508862 -2.793092 0.64992
H  -0.172982 3.182332 2.203706
H  -0.541516 1.592198 2.960848
H  1.320402 0.499396 1.848803
H  1.94901 1.993747 2.62282
H  -0.937047 1.774843 -1.224356
H  -0.897141 3.363234 -0.416699
H  -2.794117 2.779451 1.030043
H  -2.6355 1.376373 2.126121
H  3.468825 2.803114 -0.535972
H  3.704764 2.69297 1.240985
H  3.779836 0.162871 1.073539
H  5.057956 0.954793 0.141848
H  2.394688 -0.10773 -1.04536
H  3.651171 0.682502 -1.986252
H  -2.578908 -0.745299 2.23322
H  -3.192614 -2.232421 1.504867
H  -3.852986 2.624197 -1.022597
H  -4.062545 -2.354728 -0.71729
H  -5.142554 1.333926 -2.739583
H  -5.244535 -1.181599 -2.583641
H  -1.220923 -1.687431 -1.135669
H  -0.721046 -2.042682 3.161633
H  1.099322 -2.556015 -1.477472
H  1.60129 -2.910757 2.824877
H  2.52673 -3.17178 0.503933
H  4.232773 -2.754634 -2.561752
