program: Gaussian 09
title: 000211499
version: EM64L-G09RevD.01
frameworkgroup: C1[X(C17H26N6O2)]
method: RPBEPBE
basis: SDD
operation: Freq
keyword: #p
keyword: freq=noraman
keyword: PBEPBE/SDD
title: #p freq=noraman PBEPBE/SDD
converged: YES YES NO NO
title: Mulliken charges:
elementType: O O N N N N N N C C C C C C C C C C C C C C C C C H H H H H H H H H H H H H H H H H H H H H H H H H H
charge: -0.282501 -0.268753 -0.076348 -0.077997 -0.147540 -0.148632 -0.225244 -0.091559 -0.360207 -0.369395 -0.372380 -0.372533 -0.329770 -0.402286 -0.380356 -0.412450 0.145691 0.064793 -0.217167 -0.057680 0.187381 0.210098 -0.610688 -0.602285 -0.578852 0.206182 0.191107 0.187782 0.201395 0.224274 0.183440 0.183767 0.203450 0.190168 0.195175 0.256089 0.218984 0.206608 0.254374 0.211048 0.187918 0.267722 0.236274 0.270323 0.247793 0.247787 0.267202 0.250691 0.251166 0.217255 0.218686
chargesum: 0.00000
title: Mulliken charges with hydrogens summed into heavy atoms:
elementType: O O N N N N N N C C C C C C C C C C C C C C C C C
charge: -0.282501 -0.268753 -0.076348 -0.077997 -0.147540 -0.148632 -0.225244 -0.091559 0.037082 0.019782 0.035333 0.014684 0.055572 0.072787 0.080626 -0.013484 0.145691 0.064793 0.050555 0.178594 0.187381 0.210098 0.155214 0.166774 -0.142911
polarizability: 2.71864449e+02 -8.92956220e+00 2.46100397e+02 -2.15666406e+01 -7.23127662e+00 1.82418896e+02
1716.lowfreq: -2.9691 -0.0009 -0.0006 -0.0004 5.3418 8.9351 12.5719 19.2851 23.4298
frequency: 10.8985 19.2407 23.2217 45.3259 58.6767 74.9904 83.5923 94.7676 97.1271 99.4747 107.5260 116.8939 128.9649 147.4838 158.0111 181.9025 204.7625 223.2638 240.4445 255.0423 288.7155 292.0470 296.2310 328.7477 334.7151 350.9736 374.0732 378.8052 388.1553 402.2013 410.1638 431.0551 453.8707 477.7280 488.8466 499.9210 537.9085 590.8991 614.7558 640.3076 649.0605 668.8768 704.6200 735.2834 745.8832 762.6602 766.7668 782.0212 800.3140 807.3493 849.5106 863.7481 910.7968 914.8457 916.5874 949.8360 958.2282 983.0471 1003.9522 1008.7907 1017.6629 1022.4779 1046.4804 1050.8018 1055.2988 1069.3141 1082.8957 1100.6622 1129.0715 1130.0555 1131.4399 1131.9472 1136.6535 1149.5459 1161.6866 1166.5234 1186.8784 1197.7583 1203.1373 1222.3868 1231.2331 1236.8482 1260.0883 1266.8459 1270.8328 1273.9361 1285.4144 1297.7314 1300.3691 1300.8605 1310.6216 1327.2872 1340.0772 1347.0967 1356.1216 1361.9420 1374.6100 1375.7531 1385.2038 1399.5507 1412.0955 1424.8718 1428.2965 1428.8587 1450.9835 1452.6798 1459.8942 1460.5688 1462.7642 1469.8679 1472.2500 1473.5422 1477.0908 1478.8902 1479.6093 1485.7446 1506.1029 1570.7710 1612.5048 1645.7918 1659.1288 2840.1916 2847.4579 2851.8043 2863.3622 2867.4453 2878.6677 2982.3191 2992.3574 3003.6993 3008.6779 3012.6582 3013.9828 3022.9080 3027.2673 3044.8372 3051.3011 3065.3421 3085.0890 3089.3261 3098.1467 3104.2519 3104.5221 3139.6106 3140.5578 3195.7270 3239.5704
redmass: 4.3870 5.1138 3.7421 4.1642 4.5831 3.0635 3.5088 2.5450 1.3792 1.7199 1.1921 3.0730 2.3673 3.4827 6.7659 3.7217 3.0186 4.1371 2.4370 1.8820 3.8061 3.4959 3.6508 3.2646 2.3811 3.6587 5.7467 3.8303 3.1124 5.0535 2.1468 7.4720 3.6129 3.3678 4.3478 3.0054 5.5224 2.0888 4.1538 3.3651 2.0599 8.6205 10.7744 4.5917 8.6000 1.3802 2.5544 4.2850 2.9855 1.5831 1.5337 1.3596 3.3721 1.4699 2.3285 1.3321 6.1151 1.8280 2.4900 2.4863 1.3171 2.5502 3.3087 2.9998 1.9937 2.6151 1.9891 2.0420 1.9942 1.3021 2.3786 1.3028 2.8227 2.8446 2.3923 2.0311 2.0173 1.5540 1.4645 3.0476 1.9994 1.4257 2.1622 1.4391 2.2923 1.2784 1.3785 1.3827 4.6912 1.2861 1.3633 1.3496 1.2839 2.9758 1.3435 1.4226 1.6018 2.3189 1.4121 1.4455 1.5980 1.4333 1.2159 1.5480 1.0880 1.0841 1.3814 1.0892 1.1021 1.1038 1.1160 1.0436 1.1181 1.0477 1.1144 1.1060 2.6549 8.1521 10.7702 9.9875 4.7597 1.0700 1.0697 1.0711 1.0696 1.0700 1.0678 1.0877 1.0872 1.0592 1.0336 1.0330 1.0602 1.0912 1.0872 1.0899 1.0883 1.1006 1.0600 1.1062 1.1025 1.1021 1.0940 1.1023 1.1013 1.1142 1.0988
irintensity: 0.2205 0.1817 0.0678 0.5120 0.0750 0.0942 0.2392 0.0592 0.2021 0.2736 1.3897 5.9376 1.4380 4.4966 1.9592 0.8084 8.1819 6.3898 0.7512 1.8656 1.6420 0.7494 0.6082 6.7501 8.1226 7.9527 6.5124 10.3227 8.5104 5.1240 0.6486 12.2351 13.4909 1.9961 8.8176 1.5160 2.7990 6.8733 18.0079 2.8683 9.1332 0.0357 10.6362 6.0826 6.3441 6.0431 3.5141 3.4996 20.9897 23.2229 0.2313 1.0215 3.7115 4.1640 2.4658 92.8245 31.9236 4.6871 29.3611 105.5723 6.8772 5.2797 7.2374 4.9383 1.4406 3.8700 3.8379 1.7715 14.1439 0.8872 60.8930 0.0579 25.9226 50.8058 12.6644 51.7116 9.0667 20.3112 9.2460 21.0458 18.1251 13.6784 13.7068 22.1029 25.7175 1.2370 22.9582 3.7741 31.2453 0.3316 1.4935 29.8972 12.3373 21.8735 9.1149 34.9704 20.3739 15.7548 1.6319 13.7843 25.0798 57.4430 16.6866 108.5403 1.7195 2.4893 71.1538 0.6901 30.1202 6.6052 8.7098 16.8304 22.9025 14.9895 10.5573 25.9572 117.8041 5.7602 693.9999 336.4295 7.6725 61.7140 48.0809 83.3993 19.9873 18.8248 293.8054 26.4736 25.4872 4.3816 37.9147 27.1858 37.7889 34.8305 77.0544 25.8020 32.4649 5.7817 13.1738 21.0919 17.1351 16.9622 9.1319 0.7972 0.4873 27.7372 1.5539
temp: 298.150 k
press: 1.00000 atm
elementType: 8 8 7 7 7 7 7 7 6 6 6 6 6 6 6 6 6 6 6 6 6 6 6 6 6 1 1 1 1 1 1 1 1 1 1 1 1 1 1 1 1 1 1 1 1 1 1 1 1 1 1
symmnumber: 1
zpe: 1114395.6 jmol-1
zpe.correction: 0.424451 hartree
zpe.thermalcorrener: 0.449620 hartree
zpe.thermalcorrenthalpy: 0.450564 hartree
zpe.thermalcorrgfe: 0.366254 hartree
zpe.sumelectzpe: -1140.445571 hartree
zpe.sumelectthermal: -1140.420402 hartree
zpe.sumelectthermalent: -1140.419458 hartree
zpe.sumelectthermalfe: -1140.503768 hartree
dipole: 2.4598 -3.2674 0.1699
dipole: 4.0933
quadrupole: -161.8850 -144.1451 -151.4493
quadrupole: 5.3745 2.5624 3.6092
quadrupole: -9.3919 8.3481 1.0438 5.3745 2.5624 3.6092
hfenergy: -1140.8700217 hartree
pointgroup: C01 [X(C17H26N6O2)]
dipole: 0.9877395 1.2681999 -0.0976495 debye
polarizability: 272.2455285|8.9719591|245.4545521|21.0319589|-9.0019686|182.6836623 unknown
InChI: InChI=1S/C17H26N6O2/c1-4-6-21-9-11-22(12-10-21)7-5-8-23-13-18-15-14(23)16(24)20(3)17(25)19(15)2/h4,13H,1,5-12H2,2-3H3
charge 0 multiplicity 1
51 atoms
O  -1.679652 -0.815736 1.814691
O  -5.647814 -2.33442 -0.235679
N  2.918752 1.182991 0.233698
N  5.493922 -0.143384 0.007441
N  -2.070887 1.777915 0.109757
N  -4.871106 -0.206606 -0.850019
N  -3.67837 -1.550463 0.76741
N  -3.851249 2.001331 -1.315205
C  3.028206 -0.299859 0.250517
C  4.1579 1.788897 0.786919
C  4.261276 -0.757129 -0.54423
C  5.386506 1.334406 -0.016988
C  1.70776 1.687032 0.923527
C  0.407374 1.357985 0.160587
C  -0.799247 2.072369 0.806259
C  6.728379 -0.638355 -0.651297
C  -2.817559 0.591162 0.199823
C  -3.899316 0.767515 -0.680932
C  -2.727086 2.578285 -0.809328
C  6.995085 -2.096391 -0.336377
C  -2.629878 -0.59261 0.998654
C  -4.788765 -1.414931 -0.119174
C  -5.991925 0.00911 -1.785861
C  -3.624848 -2.825998 1.518639
C  7.305842 -3.045333 -1.25402
H  2.124794 -0.737892 -0.208775
H  3.105864 -0.686059 1.298201
H  4.309916 1.506692 1.859687
H  4.068301 2.890382 0.729699
H  4.354492 -1.856319 -0.485128
H  4.118972 -0.481287 -1.620513
H  5.2947 1.726247 -1.062205
H  6.300026 1.766686 0.433521
H  1.629444 1.293848 1.97126
H  1.809578 2.78898 0.999311
H  0.212464 0.271272 0.178494
H  0.521881 1.673068 -0.893398
H  -0.660752 3.169376 0.786503
H  -0.904046 1.749841 1.856722
H  7.569938 -0.029923 -0.259573
H  6.709024 -0.490793 -1.761744
H  -2.368219 3.567275 -1.084398
H  6.937691 -2.355177 0.731197
H  -6.62246 -0.891373 -1.762453
H  -5.605161 0.179452 -2.804369
H  -6.576137 0.89274 -1.478963
H  -2.728599 -2.793926 2.154998
H  -3.572993 -3.675213 0.817948
H  -4.532762 -2.941025 2.132804
H  7.522747 -4.078662 -0.960994
H  7.3558 -2.813794 -2.325742
