program: Gaussian 09
title: 000211497
version: EM64L-G09RevD.01
frameworkgroup: C1[X(C15H18I3NO3)]
method: RPBEPBE
basis: SDD
operation: Freq
keyword: #p
keyword: freq=noraman
keyword: PBEPBE/SDD
title: #p freq=noraman PBEPBE/SDD
converged: YES YES NO NO
title: Mulliken charges:
elementType: I I I O O O N C C C C C C C C C C C C C C C H H H H H H H H H H H H H H H H H H
charge: 0.143641 0.136723 0.155335 -0.406526 -0.205317 -0.261420 -0.246509 -0.384679 -0.363654 0.806569 -0.334740 -0.728398 0.667577 -0.575004 0.142497 -0.539837 -0.696814 -0.099660 -0.345533 0.195407 -0.663674 -0.763688 0.248537 0.207104 0.241043 0.210845 0.202530 0.212600 0.215805 0.220080 0.278835 0.261567 0.221493 0.219154 0.258902 0.216792 0.385497 0.255865 0.248458 0.262596
chargesum: 0.00000
title: Mulliken charges with hydrogens summed into heavy atoms:
elementType: I I I O O O N C C C C C C C C C C C C C C C
charge: 0.143641 0.136723 0.155335 -0.021028 -0.205317 -0.261420 -0.246509 -0.136141 0.084494 0.806569 0.078635 -0.728398 0.667577 -0.575004 0.142497 -0.539837 -0.048330 0.179175 0.137528 0.195407 0.031174 0.003231
polarizability: 3.30795257e+02 8.42110187e+00 2.77267949e+02 1.89604141e+00 -1.38387944e+00 1.73481815e+02
1716.lowfreq: -11.4131 -9.9828 -2.3539 0.0002 0.0003 0.0003 13.8082 14.5526 24.1884
frequency: 11.0643 13.3554 23.8926 39.0445 48.5567 52.5820 56.5052 58.4517 64.3531 83.7191 88.1825 94.9362 96.0747 102.3803 124.5272 128.4185 153.3925 159.4665 177.0971 181.6451 199.2253 225.5605 234.5612 240.8780 280.3856 307.1342 315.9057 343.3729 360.1378 379.9022 396.0643 456.2249 470.8269 479.6078 517.3495 544.4374 555.6945 583.1953 599.9103 619.9522 642.2424 668.4040 691.4003 702.7940 742.5391 756.4967 768.2043 807.2723 879.2817 883.8010 889.2003 905.0532 914.7812 983.3369 992.4936 1011.1171 1033.7718 1034.7921 1052.3641 1068.4123 1083.9931 1096.9768 1105.3350 1118.7632 1150.0055 1206.3937 1225.9704 1237.4968 1254.4786 1268.4990 1277.2102 1285.7688 1292.8572 1297.4490 1303.9572 1336.8916 1348.7050 1358.4010 1366.7573 1382.1365 1388.3922 1390.3408 1407.1597 1445.8105 1448.8854 1463.4855 1465.7684 1466.3107 1474.2732 1478.3265 1481.3571 1487.3866 1505.1904 1534.4602 1606.9165 1645.2183 2955.8430 2971.1208 2975.4419 2992.1546 2995.5488 3012.0558 3014.7055 3017.8862 3067.5653 3071.8814 3076.7883 3080.8061 3084.0865 3087.2895 3114.0407 3129.4952 3181.3545 3511.7729
redmass: 3.5021 3.9839 3.1562 4.6596 3.0853 2.2413 2.0812 4.8468 2.6487 19.1875 5.2020 9.9670 6.4322 9.8742 7.5686 3.4794 5.1371 76.8275 3.0840 2.9473 2.3874 1.8772 1.6653 1.7636 5.2604 3.4097 4.9516 4.3984 5.5416 4.2525 5.1223 4.0985 6.3189 4.0706 4.4241 3.0669 4.1159 3.4684 4.6333 3.8927 1.6686 4.9476 5.0971 3.5305 1.6427 2.6709 1.5581 2.6753 1.9613 1.4136 2.4664 2.0467 2.5573 3.4442 1.6996 6.1039 2.0090 2.1372 2.2269 2.1420 2.5185 2.2386 2.7576 2.1171 1.9937 2.1403 1.4536 2.2141 1.8938 1.4093 2.2851 1.9436 1.6787 2.1190 1.5179 1.8912 1.4937 1.4056 2.1269 1.2593 1.2170 1.2114 3.3001 1.1357 1.0588 1.0511 1.0557 1.0741 1.0655 1.0421 1.0508 1.0826 9.4358 8.6384 7.2247 9.3696 1.0784 1.0584 1.0368 1.0366 1.0377 1.0594 1.0597 1.1005 1.1009 1.1034 1.0993 1.1024 1.0972 1.0978 1.1023 1.0994 1.0934 1.0639
irintensity: 0.1391 0.1399 0.0758 0.6102 0.2700 0.1424 0.1275 1.2674 1.0417 0.4322 0.2332 0.5012 0.1588 0.1092 0.5731 3.6432 0.8664 0.0149 0.5125 0.7448 0.9836 0.1952 0.0748 0.2553 2.0165 7.5315 3.5693 2.6490 0.8910 0.4035 0.9301 21.0027 15.8222 15.8698 5.9336 20.3780 26.0753 26.2058 9.9484 4.4266 59.7295 7.1099 90.9594 9.8784 5.5730 3.1709 12.8612 13.8831 4.2594 11.0134 18.7299 21.5944 4.4977 38.1577 13.5555 6.9697 14.6609 5.3413 277.4303 10.6162 6.0411 27.0568 19.4292 12.5433 26.4775 17.5862 1.9916 25.4229 17.9653 18.6609 186.3720 32.6314 34.5796 7.2083 10.8105 25.1955 6.2458 8.1249 49.2864 55.1679 28.4406 13.7861 176.4930 31.5085 15.2315 8.3582 12.0944 2.2851 7.9624 12.4026 13.3897 16.9949 38.1863 17.6679 261.1672 198.4858 29.9389 32.9853 31.8971 27.9108 4.2986 20.0781 18.6484 10.4797 17.3367 1.9019 36.6797 49.1040 5.7964 35.3647 20.0864 11.2444 0.3222 36.8230
temp: 298.150 k
press: 1.00000 atm
elementType: 53 53 53 8 8 8 7 6 6 6 6 6 6 6 6 6 6 6 6 6 6 6 1 1 1 1 1 1 1 1 1 1 1 1 1 1 1 1 1 1
symmnumber: 1
zpe: 785485.3 jmol-1
zpe.correction: 0.299176 hartree
zpe.thermalcorrener: 0.325528 hartree
zpe.thermalcorrenthalpy: 0.326472 hartree
zpe.thermalcorrgfe: 0.235169 hartree
zpe.sumelectzpe: -895.685086 hartree
zpe.sumelectthermal: -895.658734 hartree
zpe.sumelectthermalent: -895.657790 hartree
zpe.sumelectthermalfe: -895.749093 hartree
dipole: -3.9943 -0.5981 2.1936
dipole: 4.5961
quadrupole: -180.1566 -169.2958 -174.9820
quadrupole: -11.4459 6.1193 2.6706
quadrupole: -5.3451 5.5157 -0.1705 -11.4459 6.1193 2.6706
hfenergy: -895.9842617 hartree
pointgroup: C01 [X(C15H18I3N1O3)]
dipole: 1.6283465 -0.6676456 0.4153849 debye
polarizability: 329.6433664|14.8467715|180.2029377|5.2918796|23.4190747|271.6987156 unknown
InChI: InChI=1S/C15H18I3NO3/c1-4-6-9(15(21)22)12-10(16)7-11(17)14(13(12)18)19(5-2)8(3)20/h7,9,21H,4-6H2,1-3H3
charge 0 multiplicity 1
40 atoms
I  -0.319425 -0.234074 -2.601998
I  2.916373 1.109481 2.631783
I  -3.033679 0.359017 2.904712
O  4.51315 1.450432 -1.008734
O  2.597357 2.693297 -0.615635
O  -4.577868 0.350065 -1.391698
N  -2.600505 -0.291067 -0.362935
C  2.439515 0.218718 -0.685912
C  3.340628 -1.00095 -0.323738
C  1.145891 0.299237 0.126042
C  2.639083 -2.360974 -0.542052
C  -0.130779 0.049051 -0.459481
C  -1.359191 0.029314 0.275549
C  1.135063 0.597896 1.519813
C  3.14837 1.576315 -0.719784
C  -1.282245 0.322882 1.664527
C  3.564513 -3.544053 -0.185888
C  -0.051065 0.620248 2.279447
C  -2.907311 -1.72226 -0.676233
C  -3.504411 0.693196 -0.816095
C  -3.873713 -2.393941 0.317866
C  -3.116826 2.150051 -0.599715
H  2.151788 0.069069 -1.748337
H  3.686119 -0.92798 0.722859
H  4.245425 -0.944385 -0.955374
H  1.720304 -2.415668 0.074886
H  2.313279 -2.447837 -1.598289
H  4.481903 -3.533003 -0.803885
H  3.874354 -3.4997 0.87514
H  3.058801 -4.512811 -0.34964
H  -0.017701 0.862026 3.343239
H  -3.353418 -1.734299 -1.68615
H  -1.946971 -2.266952 -0.714795
H  -3.437968 -2.476628 1.327998
H  -4.815301 -1.824488 0.381519
H  -4.111165 -3.413138 -0.04046
H  4.905526 2.361956 -1.092575
H  -2.073686 2.354722 -0.897115
H  -3.230551 2.434659 0.462255
H  -3.797065 2.771375 -1.200617
