program: Gaussian 09
title: 000211495
version: EM64L-G09RevD.01
frameworkgroup: C1[X(C11H12I3NO2)]
method: RPBEPBE
basis: SDD
operation: Freq
keyword: #p
keyword: freq=noraman
keyword: PBEPBE/SDD
title: #p freq=noraman PBEPBE/SDD
converged: YES YES NO NO
title: Mulliken charges:
elementType: I I I O O N C C C C C C C C C C C H H H H H H H H H H H H
charge: 0.093271 0.105862 0.112917 -0.409826 -0.203239 -0.684610 -0.386841 -0.362139 0.817742 -0.336225 0.140801 -0.790990 -0.584095 -0.698888 0.867510 -0.094531 -0.616144 0.242648 0.208337 0.238099 0.218390 0.198395 0.216424 0.218160 0.210460 0.269560 0.382866 0.311996 0.314090
chargesum: 0.00000
title: Mulliken charges with hydrogens summed into heavy atoms:
elementType: I I I O O N C C C C C C C C C C C
charge: 0.093271 0.105862 0.112917 -0.026960 -0.203239 -0.058523 -0.144193 0.084296 0.817742 0.080560 0.140801 -0.790990 -0.584095 -0.053844 0.867510 0.175028 -0.616144
polarizability: 2.71986922e+02 6.13188497e+00 2.47212476e+02 3.39950514e+00 -2.24137436e+00 1.15070995e+02
1716.lowfreq: -4.8943 -2.0244 -0.0004 -0.0003 0.0000 4.7255 24.5515 36.9260 54.6543
frequency: 24.4308 36.9207 54.6380 59.1767 67.2704 68.5208 88.7763 95.5971 99.0580 111.8525 135.8965 157.8850 180.3203 201.5118 228.8782 269.0649 277.7101 301.6851 318.4545 321.1293 346.2667 373.2697 434.0784 454.4036 485.4662 497.4926 542.7013 547.7565 588.1524 606.1333 639.3731 665.2481 693.3480 727.1813 766.7860 770.2650 863.6230 880.6439 882.1951 901.1668 964.4179 996.4119 1033.3929 1051.4945 1056.2057 1074.1517 1109.2257 1120.9323 1208.1629 1228.3396 1256.6632 1278.4036 1282.2072 1295.0935 1303.2330 1310.2883 1346.9971 1353.1747 1375.9333 1391.0333 1442.6946 1467.7857 1475.0440 1477.1519 1487.6118 1519.7213 1566.3904 1629.6504 1648.4922 2962.0502 2972.7310 2974.4685 3013.7202 3020.0830 3066.1135 3075.0514 3080.0247 3182.4386 3512.9479 3515.2599 3656.1035
redmass: 7.3230 3.5463 4.5740 7.0266 5.3218 2.0257 45.2374 9.3474 11.7277 10.7030 6.8437 102.7816 3.1111 4.6684 1.1477 7.0571 5.2053 4.9367 4.9708 4.4878 5.7807 6.0262 1.0931 3.4637 1.3219 3.5330 2.7951 4.0148 3.4851 8.9784 1.6939 5.0920 4.7507 1.8138 1.8590 8.4764 4.0687 1.7085 1.3991 1.7833 3.1154 10.3488 2.5622 2.2240 1.9873 1.7979 2.4902 2.1254 2.0559 1.4522 1.3062 1.3760 2.5283 1.4846 1.5771 1.3756 3.5019 1.5574 3.6052 1.2193 4.6524 1.0742 1.0635 1.0419 1.0846 7.4912 4.6390 1.3378 9.3209 1.0783 1.0532 1.0426 1.0597 1.1002 1.1009 1.0992 1.1025 1.0930 1.0639 1.0457 1.1035
irintensity: 0.1842 0.1144 0.1052 1.0761 0.9076 0.2346 0.0275 0.4017 1.0128 0.9653 0.5097 0.0139 0.4143 0.1280 0.0388 3.2004 3.8955 6.3422 3.0223 0.7530 5.2104 6.2595 12.1740 11.5599 226.1868 20.0144 20.7603 7.2132 42.4047 37.7415 44.4909 24.0846 88.5340 2.6614 15.0126 21.1742 8.1057 4.0640 9.4035 8.2972 85.4041 19.5946 25.0027 255.1909 34.1107 12.5754 22.1023 16.3234 9.1681 4.9810 9.8782 7.7180 3.1448 31.6600 23.1220 7.8495 18.0341 2.4402 7.8761 12.0800 165.5544 1.0518 5.8897 11.8329 16.5033 29.0436 0.3267 264.3025 206.5400 20.2892 41.0480 20.9102 18.7770 7.7908 17.7378 40.1309 52.7381 0.0354 34.0776 57.5510 62.8369
temp: 298.150 k
press: 1.00000 atm
elementType: 53 53 53 8 8 7 6 6 6 6 6 6 6 6 6 6 6 1 1 1 1 1 1 1 1 1 1 1 1
symmnumber: 1
zpe: 547564.4 jmol-1
zpe.correction: 0.208556 hartree
zpe.thermalcorrener: 0.228136 hartree
zpe.thermalcorrenthalpy: 0.229080 hartree
zpe.thermalcorrgfe: 0.155762 hartree
zpe.sumelectzpe: -664.826345 hartree
zpe.sumelectthermal: -664.806766 hartree
zpe.sumelectthermalent: -664.805822 hartree
zpe.sumelectthermalfe: -664.879139 hartree
dipole: 0.3181 2.0298 1.4673
dipole: 2.5248
quadrupole: -127.0759 -134.5132 -152.7950
quadrupole: 4.9021 2.0954 -0.3317
quadrupole: 11.0522 3.6148 -14.6670 4.9021 2.0954 -0.3317
hfenergy: -665.0349017 hartree
pointgroup: C01 [X(C11H12I3N1O2)]
dipole: -0.1239887 -0.9838478 -0.0579563 debye
polarizability: 270.5824628|15.4678061|190.3569118|-11.2143738|64.0948258|173.3310188 unknown
InChI: InChI=1S/C11H12I3NO2/c1-2-3-5(11(16)17)8-6(12)4-7(13)10(15)9(8)14/h4-5,16H,2-3,15H2,1H3
charge 0 multiplicity 1
29 atoms
I  -0.46142 -2.115363 -2.292788
I  0.952089 2.520588 1.75822
I  -4.733673 0.590208 1.253253
O  3.486497 1.324226 -1.093651
O  1.430219 2.104124 -1.820865
N  -3.31054 -1.393801 -0.969025
C  1.534189 -0.021002 -0.539836
C  2.409724 -0.629486 0.598049
C  0.059948 0.148967 -0.166018
C  1.965834 -2.050476 1.011686
C  2.088001 1.254911 -1.18305
C  -0.956136 -0.664379 -0.741357
C  -0.370729 1.098936 0.805785
C  2.855611 -2.621387 2.136796
C  -2.347417 -0.590895 -0.390559
C  -1.723411 1.208282 1.188021
C  -2.687571 0.373619 0.608188
H  1.584758 -0.750997 -1.375232
H  2.40097 0.033447 1.48179
H  3.453919 -0.656885 0.237791
H  0.910798 -2.034201 1.348617
H  2.003169 -2.72402 0.131644
H  2.806783 -1.986237 3.041172
H  2.537869 -3.64069 2.422253
H  3.914412 -2.673133 1.820046
H  -2.0232 1.945494 1.935005
H  3.792763 2.133382 -1.586759
H  -3.062681 -2.069456 -1.688576
H  -4.286373 -1.293871 -0.695703
