program: Gaussian 09
title: 000216673
version: EM64L-G09RevD.01
frameworkgroup: C1[X(C13H11N3O3)]
method: RPBEPBE
basis: SDD
operation: Freq
keyword: #p
keyword: freq=noraman
keyword: PBEPBE/SDD
title: #p freq=noraman PBEPBE/SDD
converged: YES YES NO NO
title: Mulliken charges:
elementType: O O O N N N C C C C C C C C C C C C C H H H H H H H H H H H
charge: -0.259228 -0.200102 -0.202843 -0.418530 -0.114051 0.027342 0.283595 0.152528 0.142483 -0.321566 -0.322783 0.389819 -0.358446 -0.371048 0.174160 -0.282398 -0.306333 -0.169933 -0.780292 0.286793 0.233230 0.332549 0.291331 0.290234 0.308109 0.240993 0.239897 0.250132 0.232286 0.232072
chargesum: 0.00000
title: Mulliken charges with hydrogens summed into heavy atoms:
elementType: O O O N N N C C C C C C C C C C C C C
charge: -0.259228 -0.200102 -0.202843 -0.085981 -0.114051 0.027342 0.283595 0.152528 0.142483 -0.034773 -0.089554 0.389819 -0.067115 -0.080814 0.174160 0.025711 -0.065340 0.069964 -0.065801
polarizability: 3.35387560e+02 3.27229355e+00 1.80038963e+02 -4.61110826e+00 -5.84520033e+00 7.49597047e+01
1716.lowfreq: -60.2050 -8.2992 -3.2218 -1.3466 -0.0009 -0.0008 -0.0007 22.9637 33.0874
frequency: -60.1384 22.9600 33.0786 52.8672 63.9338 85.8937 96.8874 167.0791 191.9776 195.1616 229.3788 254.0244 288.7145 302.0719 379.2911 404.6481 408.0501 439.6911 459.9268 494.8539 522.5474 537.8836 587.2929 602.3913 623.9472 657.2644 678.5033 686.8155 710.4197 739.9575 752.1325 765.7917 791.6248 809.0800 845.8688 868.7460 885.0249 921.5785 921.7054 956.5187 985.8300 996.5994 1002.1038 1005.1337 1011.6777 1047.0694 1081.4220 1091.4908 1101.0921 1115.4187 1173.8788 1184.5370 1218.8376 1228.6192 1248.0295 1284.2977 1299.9266 1352.1738 1365.0736 1371.5642 1392.2560 1402.4182 1411.4485 1449.4405 1461.8577 1468.4813 1475.6918 1509.8038 1570.9909 1577.5914 1589.3385 1604.7892 1609.8025 2987.3614 3065.7248 3118.2631 3136.5634 3142.3202 3163.8930 3166.0551 3184.6688 3188.1406 3202.6718 3510.4739
redmass: 1.0181 5.2089 6.0589 6.5708 6.7507 6.7745 7.3441 6.1798 5.5673 4.1641 5.8520 4.9786 5.8241 7.4602 5.9948 4.1032 2.8935 3.6130 4.2315 8.0075 6.0398 5.2043 2.9821 7.1017 7.0784 5.8909 5.6036 4.0435 1.5232 6.3991 2.2347 4.0074 8.7032 1.5863 1.4134 4.4649 1.7024 2.7811 1.3425 6.8719 1.3703 2.1399 1.3245 2.1848 1.5326 1.5784 1.6319 3.3589 1.9773 1.4672 1.1276 1.3894 4.7748 2.5556 2.0534 4.2674 1.3648 4.5396 5.7786 3.2387 1.2583 11.4411 3.8811 2.5827 1.2027 1.0461 2.2342 2.2831 7.0652 7.3908 5.4219 6.7745 7.0115 1.0382 1.0973 1.0984 1.0906 1.0883 1.0972 1.0898 1.0945 1.0964 1.0963 1.0756
irintensity: 0.3772 0.0081 0.0265 0.1965 0.1602 4.0540 6.6376 9.0450 1.2435 2.7542 4.7067 0.7641 6.3111 7.8393 3.7385 0.2896 0.2134 1.2510 10.1213 6.7481 2.8114 5.4607 5.5010 10.4107 0.3947 3.4657 7.0686 20.1042 87.7291 14.7511 0.3631 5.0324 39.6995 82.1655 11.8426 16.7615 44.4279 4.7655 4.2589 3.6707 2.2672 3.8674 2.5283 7.8403 0.0230 8.5438 11.1903 27.7854 7.4997 15.9266 7.3527 49.7703 423.1583 1.9771 49.7479 2.7055 0.7926 17.8603 120.9925 68.0839 28.8561 5.7842 52.1831 398.4805 26.5854 15.8742 26.1509 367.0436 152.7060 70.3857 41.1781 22.5762 30.5078 19.1871 17.4190 8.7431 9.9888 6.5155 18.7650 1.1681 1.3834 1.2250 5.6476 26.5081
temp: 298.150 k
press: 1.00000 atm
elementType: 8 8 8 7 7 7 6 6 6 6 6 6 6 6 6 6 6 6 6 1 1 1 1 1 1 1 1 1 1 1
symmnumber: 1
zpe: 580131.5 jmol-1
zpe.correction: 0.220960 hartree
zpe.thermalcorrener: 0.236625 hartree
zpe.thermalcorrenthalpy: 0.237569 hartree
zpe.thermalcorrgfe: 0.175521 hartree
zpe.sumelectzpe: -890.516727 hartree
zpe.sumelectthermal: -890.501062 hartree
zpe.sumelectthermalent: -890.500118 hartree
zpe.sumelectthermalfe: -890.562167 hartree
dipole: 6.1245 0.8421 0.0587
dipole: 6.1824
quadrupole: -122.3306 -109.2566 -111.4626
quadrupole: 7.7067 -0.1489 -1.3951
quadrupole: -7.9807 5.0933 2.8874 7.7067 -0.1489 -1.3951
hfenergy: -890.7376875 hartree
pointgroup: C01 [X(C13H11N3O3)]
dipole: -2.4131224 -0.3037082 0.0305711 debye
polarizability: 335.3973211|1.8776555|180.3050026|5.655089|-0.2454962|74.6839044 unknown
InChI: InChI=1S/C13H11N3O3/c1-9-3-2-4-12(14-9)15-13(17)10-5-7-11(8-6-10)16(18)19/h2-8,15H,1H3
charge 0 multiplicity 1
30 atoms
O  -0.545881 2.233115 -0.290465
O  6.132975 0.235513 0.365076
O  5.538031 -1.91769 -0.098567
N  -1.279055 0.029662 0.032194
N  -3.33595 -1.001035 0.200784
N  5.255465 -0.674947 0.107833
C  1.129684 0.49651 -0.06413
C  -2.687431 0.184257 -0.016044
C  -0.294446 0.999324 -0.123064
C  2.136947 1.459742 0.20511
C  1.501087 -0.855161 -0.297404
C  3.827539 -0.267019 0.046141
C  3.490839 1.086538 0.267624
C  2.852628 -1.245255 -0.243803
C  -4.700406 -1.017863 0.180698
C  -3.350252 1.411526 -0.261081
C  -5.448491 0.16652 -0.060645
C  -4.761853 1.379836 -0.280847
C  -5.378107 -2.3495 0.425765
H  1.82848 2.498895 0.353565
H  0.75278 -1.611334 -0.559903
H  -1.012645 -0.936284 0.246246
H  4.28134 1.810631 0.480123
H  3.163408 -2.27694 -0.426672
H  -2.775147 2.324179 -0.419851
H  -6.542175 0.126837 -0.07225
H  -5.319024 2.304041 -0.466794
H  -4.620589 -3.129997 0.594797
H  -6.041833 -2.302728 1.308935
H  -6.003416 -2.643868 -0.437472
