program: Gaussian 09
title: 000211494
version: EM64L-G09RevD.01
frameworkgroup: C1[X(C11H10I3NO3)]
method: RPBEPBE
basis: SDD
operation: Freq
keyword: #p
keyword: freq=noraman
keyword: PBEPBE/SDD
title: #p freq=noraman PBEPBE/SDD
converged: YES YES NO NO
title: Mulliken charges:
elementType: I I I O O O N C C C C C C C C C C C H H H H H H H H H H
charge: 0.120398 0.142606 0.148343 -0.393937 -0.212175 -0.213257 -0.495573 -0.351607 0.805569 -0.751202 -0.666605 0.755928 -0.571795 -0.515548 -0.099506 0.153635 0.228379 -0.772592 0.247008 0.227501 0.233676 0.254422 0.277288 0.320674 0.384595 0.258586 0.264614 0.220575
chargesum: 0.00000
title: Mulliken charges with hydrogens summed into heavy atoms:
elementType: I I I O O O N C C C C C C C C C C C
charge: 0.120398 0.142606 0.148343 -0.009342 -0.212175 -0.213257 -0.174898 -0.104599 0.805569 -0.751202 0.048994 0.755928 -0.571795 -0.515548 0.177782 0.153635 0.228379 -0.028817
polarizability: 2.90645350e+02 4.55462573e+00 2.43861691e+02 2.43899018e+00 -5.88327744e+00 1.13648275e+02
1716.lowfreq: -1.4949 -0.0003 -0.0003 0.0002 6.2494 7.3633 26.9653 32.3940 41.2451
frequency: 26.9590 32.3669 41.1970 50.8707 56.9281 74.0412 79.4834 87.6853 92.5601 103.8889 114.0370 143.3096 157.0909 160.8547 182.1891 191.5396 233.1448 257.4001 297.8050 306.8892 322.4394 369.0018 412.1853 455.3886 480.3440 498.6007 512.6431 536.7377 556.9085 586.9352 607.9967 630.2459 636.1191 689.8208 703.0323 739.6920 772.2404 817.0016 886.9702 904.6912 952.8123 987.6751 1009.2629 1014.1205 1032.2027 1035.7898 1095.7120 1116.4943 1212.4424 1222.2025 1247.9253 1262.7034 1274.8361 1298.3015 1311.8369 1353.7342 1383.2305 1394.3553 1411.8064 1433.5362 1456.2662 1465.1298 1467.9918 1481.0591 1521.1845 1543.5426 1646.4290 1655.1996 2969.3699 2991.5965 3003.5651 3079.3627 3103.0319 3112.3047 3126.7497 3184.0729 3518.7821 3523.2543
redmass: 8.2544 6.5780 1.9703 1.9989 5.0801 3.5329 13.4887 19.1428 12.8913 26.0473 7.7483 5.7887 6.6478 19.8639 1.2487 2.6810 4.9284 5.8132 5.3871 5.4134 5.3888 7.3733 4.1259 4.6633 2.1023 1.7845 4.9758 4.1024 3.4224 3.0663 3.8039 2.3353 3.9954 7.5183 5.5010 4.7831 5.4689 3.4320 1.4082 3.5262 4.1384 1.9239 2.1554 3.6766 2.6463 1.6659 1.8845 2.3943 2.5474 2.7114 2.3744 1.4866 1.9364 2.3467 5.7983 2.3264 1.2315 1.2080 3.2333 1.5372 1.2676 1.0458 1.0642 1.0615 7.1024 9.2942 7.1279 9.2055 1.0788 1.0378 1.0354 1.0986 1.1006 1.1001 1.0984 1.0933 1.0641 1.0767
irintensity: 0.6812 0.7224 1.7439 1.5202 1.2521 5.3075 0.8866 0.5893 2.0319 1.0949 1.9478 0.7341 1.4846 0.4572 0.0019 0.4168 4.1514 1.4026 0.8283 0.9645 1.9682 1.8057 11.4644 22.6626 5.1156 109.4917 7.3082 6.2826 14.1420 14.7796 27.2474 23.6963 46.6290 72.7945 48.3260 1.7189 14.7863 12.3333 11.1537 8.0183 8.2989 23.3746 39.6030 33.1972 107.6770 13.5853 31.5777 64.1088 74.2203 23.0267 53.8031 15.9160 57.5762 37.4106 7.8555 24.0701 66.3807 27.7608 135.6954 245.4031 79.8487 11.0465 19.8402 8.0871 45.5901 18.7849 140.8849 277.4999 26.3253 8.8729 20.6304 13.1510 10.9899 10.5450 7.8720 0.2451 32.5319 21.3535
temp: 298.150 k
press: 1.00000 atm
elementType: 53 53 53 8 8 8 7 6 6 6 6 6 6 6 6 6 6 6 1 1 1 1 1 1 1 1 1 1
symmnumber: 1
zpe: 494710.3 jmol-1
zpe.correction: 0.188425 hartree
zpe.thermalcorrener: 0.208910 hartree
zpe.thermalcorrenthalpy: 0.209855 hartree
zpe.thermalcorrgfe: 0.133814 hartree
zpe.sumelectzpe: -738.799687 hartree
zpe.sumelectthermal: -738.779201 hartree
zpe.sumelectthermalent: -738.778257 hartree
zpe.sumelectthermalfe: -738.854298 hartree
dipole: 1.7087 1.6128 -2.9508
dipole: 3.7720
quadrupole: -147.3640 -138.2281 -151.1111
quadrupole: 10.0089 -12.3518 -2.2708
quadrupole: -1.7963 7.3397 -5.5434 10.0089 -12.3518 -2.2708
hfenergy: -738.9881119 hartree
pointgroup: C01 [X(C11H10I3N1O3)]
dipole: 0.589212 0.3424914 -1.3182914 debye
polarizability: 290.11281|1.6472953|234.3903932|-10.7712653|-34.2795523|123.6521129 unknown
InChI: InChI=1S/C11H10I3NO3/c1-4(11(17)18)8-6(12)3-7(13)10(9(8)14)15-5(2)16/h3-4,15,17H,1-2H3
charge 0 multiplicity 1
28 atoms
I  0.428182 2.588474 -1.198488
I  -2.98211 -2.410693 0.545439
I  2.992635 -2.874443 -0.003002
O  -2.581291 0.91601 1.900922
O  -4.544698 1.046774 0.666457
O  3.425306 0.320604 1.498994
N  2.662127 0.360451 -0.710804
C  -2.371666 0.831783 -0.5088
C  -1.110837 -0.008513 -0.312063
C  0.186583 0.522287 -0.572259
C  -3.135472 0.478436 -1.808567
C  1.392115 -0.230541 -0.450067
C  -1.142518 -1.375611 0.090106
C  1.279772 -1.593421 -0.070615
C  0.022817 -2.157123 0.217291
C  -3.305476 0.896672 0.704473
C  3.61568 0.623481 0.292446
C  4.896527 1.269927 -0.222784
H  -2.044064 1.887028 -0.611538
H  -2.491554 0.672029 -2.683959
H  -3.44697 -0.578539 -1.825875
H  -4.043074 1.099887 -1.886323
H  -0.047722 -3.203859 0.517961
H  2.827915 0.747677 -1.642788
H  -3.208635 1.020608 2.666735
H  5.621092 0.481496 -0.498904
H  5.33988 1.86975 0.586252
H  4.731158 1.913369 -1.105442
