program: Gaussian 09
title: 000211493
version: EM64L-G09RevD.01
frameworkgroup: C1[X(C12H12I3NO3)]
method: RPBEPBE
basis: SDD
operation: Freq
keyword: #p
keyword: freq=noraman
keyword: PBEPBE/SDD
title: #p freq=noraman PBEPBE/SDD
converged: YES YES NO NO
title: Mulliken charges:
elementType: I I I O O O N C C C C C C C C C C C C H H H H H H H H H H H H
charge: 0.153432 0.150309 0.162702 -0.401148 -0.208513 -0.262042 -0.253832 -0.356817 0.809676 0.687656 -0.738207 -0.577796 -0.664030 -0.524953 -0.107923 0.152599 -0.625125 0.197967 -0.755406 0.249190 0.231052 0.233325 0.255106 0.279551 0.281489 0.237895 0.240391 0.251185 0.254165 0.263506 0.384593
chargesum: 0.00000
title: Mulliken charges with hydrogens summed into heavy atoms:
elementType: I I I O O O N C C C C C C C C C C C C
charge: 0.153432 0.150309 0.162702 -0.016555 -0.208513 -0.262042 -0.253832 -0.107626 0.809676 0.687656 -0.738207 -0.577796 0.055454 -0.524953 0.171628 0.152599 0.134650 0.197967 0.013451
polarizability: 3.01429043e+02 4.92472245e+00 2.50463584e+02 5.06606807e+00 -3.38894442e+00 1.29385161e+02
1716.lowfreq: -8.6878 -4.7569 -0.0004 -0.0003 0.0002 7.6470 27.8433 28.6051 52.3310
frequency: 27.7975 28.5451 52.3246 56.8468 71.4361 80.8986 86.3053 88.8175 99.6533 100.9365 116.0820 140.6445 147.3282 157.6674 159.8731 161.2529 177.9882 189.7810 209.0617 267.8056 295.1158 314.7031 332.8449 353.4028 382.3400 451.2359 458.9418 478.2787 491.8014 524.0130 549.1525 578.3694 607.1807 621.4558 633.4931 673.1197 698.1810 716.2299 763.4537 780.4077 843.4752 879.4902 940.4799 969.7370 997.1667 1009.3428 1028.9285 1035.7285 1080.0338 1111.5853 1118.6506 1126.3192 1149.2297 1219.1574 1239.5273 1261.1527 1270.1009 1296.9061 1305.6413 1330.6679 1353.0387 1382.5774 1393.0085 1398.6924 1423.4027 1445.4087 1466.2620 1467.8913 1477.7212 1479.9707 1484.0957 1507.3323 1535.0360 1616.1477 1657.9107 2963.3974 2982.2680 2994.0870 3004.7262 3068.8503 3080.9035 3104.0684 3111.9990 3113.3884 3132.8492 3183.4602 3516.5982
redmass: 9.6170 7.4647 6.8166 6.9283 1.3795 13.9141 21.8412 8.7515 11.8957 2.3015 6.0039 1.2520 3.8677 3.0623 13.0211 3.8436 1.6063 2.0444 4.1065 5.4470 4.4089 5.1158 5.6906 5.3463 5.5551 4.3227 4.7308 7.8026 3.8655 4.0306 3.8309 3.1748 3.6265 4.7481 1.7578 7.9691 7.1298 4.5019 7.4182 4.1332 3.0919 1.3946 2.8650 1.8632 2.3412 4.0724 2.3532 1.6502 2.3091 2.3366 2.5750 1.3424 1.9003 2.1820 3.1735 1.6794 2.1557 2.3921 5.5742 2.8900 2.6879 1.2414 1.3469 2.0526 1.4388 1.0780 1.0448 1.0484 1.0827 1.0636 1.0558 8.8330 8.8991 7.4446 9.1420 1.0788 1.0335 1.0378 1.0353 1.1027 1.0981 1.1006 1.0990 1.1000 1.0991 1.0931 1.0641
irintensity: 0.1157 0.4941 0.8519 0.2019 1.7312 0.9239 0.3097 0.0027 0.0899 0.4539 0.1007 1.6699 1.1424 1.4807 0.2183 0.8983 0.2047 0.4150 0.9995 1.8503 3.9373 4.7358 6.7090 2.2160 0.2172 4.4609 24.3210 16.1971 23.2331 18.4774 6.9058 4.9779 38.4066 2.4402 63.9029 6.5541 78.7287 11.4303 3.5299 35.0175 1.5731 10.3008 5.1366 37.1941 5.9888 60.2630 112.1132 6.4830 21.4496 25.2953 52.6499 1.0684 109.0977 7.4985 74.0417 12.3369 9.0462 65.1915 23.5785 83.7305 50.9139 43.5886 9.3315 117.7874 123.5477 34.3452 8.9300 14.7925 19.5084 8.1443 15.7214 39.3601 8.5643 279.6076 272.7808 31.7260 44.9494 5.4385 19.4564 15.7390 5.2693 10.4742 0.1168 9.9039 11.1004 0.2499 31.9400
temp: 298.150 k
press: 1.00000 atm
elementType: 53 53 53 8 8 8 7 6 6 6 6 6 6 6 6 6 6 6 6 1 1 1 1 1 1 1 1 1 1 1 1
symmnumber: 1
zpe: 566331.2 jmol-1
zpe.correction: 0.215704 hartree
zpe.thermalcorrener: 0.237632 hartree
zpe.thermalcorrenthalpy: 0.238576 hartree
zpe.thermalcorrgfe: 0.160219 hartree
zpe.sumelectzpe: -778.017980 hartree
zpe.sumelectthermal: -777.996052 hartree
zpe.sumelectthermalent: -777.995107 hartree
zpe.sumelectthermalfe: -778.073464 hartree
dipole: -2.1421 -1.3676 -0.4202
dipole: 2.5759
quadrupole: -182.5236 -150.2050 -146.4338
quadrupole: -4.9442 -7.4326 -2.7445
quadrupole: -22.8028 9.5157 13.2870 -4.9442 -7.4326 -2.7445
hfenergy: -778.2336837 hartree
pointgroup: C01 [X(C12H12I3N1O3)]
dipole: -0.8163015 -0.6005703 0.0056156 debye
polarizability: 300.8984756|8.0416592|240.6325748|1.1467957|-34.2764817|139.7467379 unknown
InChI: InChI=1S/C12H12I3NO3/c1-5(12(18)19)9-7(13)4-8(14)11(10(9)15)16(3)6(2)17/h4-5,18H,1-3H3
charge 0 multiplicity 1
31 atoms
I  0.377478 2.488865 -1.175541
I  -3.149064 -2.468864 0.440703
I  2.873047 -2.850439 0.55006
O  -2.79362 0.848572 1.853697
O  -4.690147 0.993555 0.520462
O  4.452429 1.43415 0.275535
N  2.586228 0.270991 -0.488895
C  -2.460987 0.777576 -0.54536
C  -1.217712 -0.071128 -0.285409
C  1.289983 -0.293912 -0.263951
C  0.094344 0.454746 -0.484593
C  -1.280776 -1.437221 0.116172
C  -3.15813 0.442827 -1.886834
C  1.144093 -1.643159 0.156602
C  -0.127638 -2.216792 0.339085
C  -3.455441 0.838944 0.618412
C  3.188104 0.093436 -1.829687
C  3.308255 0.953402 0.515374
C  2.634783 1.068634 1.87728
H  -2.118718 1.830703 -0.623138
H  -2.468049 0.641379 -2.724983
H  -3.476854 -0.611094 -1.932781
H  -4.055303 1.072971 -2.005022
H  -0.218448 -3.257524 0.655037
H  4.163555 0.60492 -1.815477
H  2.54762 0.544206 -2.608909
H  3.340249 -0.978454 -2.05097
H  2.439548 0.073567 2.315744
H  1.671081 1.604382 1.809815
H  3.310444 1.626722 2.54133
H  -3.463055 0.95204 2.583341
