program: Gaussian 09
title: 000211491
version: EM64L-G09RevD.01
frameworkgroup: C1[X(C16H25NO2)]
method: RPBEPBE
basis: SDD
operation: Freq
keyword: #p
keyword: freq=noraman
keyword: PBEPBE/SDD
title: #p freq=noraman PBEPBE/SDD
converged: YES YES NO NO
title: Mulliken charges:
elementType: O O N C C C C C C C C C C C C C C C C H H H H H H H H H H H H H H H H H H H H H H H H H
charge: -0.466767 -0.437178 -0.180039 0.027761 -0.445660 -0.466380 -0.388395 -0.362350 -0.029993 -0.387363 -0.215041 -0.777711 -0.716241 0.433475 -0.397910 -0.368093 -0.392162 -0.349587 0.278478 0.185555 0.195369 0.200445 0.205059 0.206004 0.238355 0.182005 0.187839 0.218378 0.200688 0.198330 0.196467 0.193316 0.251901 0.229949 0.226883 0.221137 0.209274 0.217705 0.353862 0.226673 0.284949 0.214436 0.246768 0.349807
chargesum: 0.00000
title: Mulliken charges with hydrogens summed into heavy atoms:
elementType: O O N C C C C C C C C C C C C C C C C
charge: -0.112904 -0.087371 -0.180039 0.213316 -0.049845 -0.055316 0.031965 0.043868 0.170694 0.007434 -0.021726 -0.068980 -0.068124 0.433475 -0.171236 -0.083145 -0.177725 -0.102819 0.278478
polarizability: 2.65388089e+02 -2.85281400e+00 1.48537694e+02 5.23127603e+00 1.64107681e+01 1.48977859e+02
1716.lowfreq: -28.0912 -9.9249 -5.0761 -0.0006 -0.0002 0.0004 22.6699 31.8176 33.6892
frequency: 20.7849 31.5948 32.8689 55.6083 67.2836 91.8441 117.2606 161.1097 175.5364 198.3601 207.2920 226.9784 238.4332 255.8590 273.1489 306.3259 339.9967 347.0908 358.9666 369.1325 379.3860 405.1712 410.7278 436.4846 441.9742 454.1493 479.5046 517.6342 541.8360 593.2962 631.6863 653.1919 714.9040 732.8251 745.1161 754.8826 778.6480 797.8730 804.6712 813.6957 825.6062 852.1533 860.0604 916.5165 922.7605 925.2903 939.3621 973.3073 973.8121 982.2764 1002.9073 1005.4029 1013.9226 1047.8043 1056.6511 1074.0509 1093.1796 1100.7951 1104.6866 1112.2578 1132.6522 1143.3362 1144.1419 1160.8425 1171.7826 1192.7201 1202.9567 1232.3037 1238.9468 1242.5279 1248.3466 1268.5598 1276.3695 1280.0881 1287.5727 1300.2705 1315.3965 1318.6715 1333.8031 1337.2457 1343.0443 1352.4347 1357.8449 1377.6684 1388.3590 1390.0323 1396.2444 1401.7599 1424.0105 1448.1031 1457.9393 1465.8836 1468.1766 1475.0644 1478.6747 1478.8815 1487.4945 1488.6422 1503.5044 1599.2991 1626.5513 2860.5782 2867.1610 2895.5602 2914.3257 2932.8235 2959.8696 2971.9735 2974.9393 2978.1275 2993.3083 3010.5260 3033.3625 3041.2482 3043.3577 3068.5246 3071.3108 3074.5319 3089.0273 3097.0205 3104.2921 3128.5147 3156.5447 3170.1433 3177.2587 3581.1749
redmass: 4.7462 3.3782 4.1907 3.3177 4.6225 2.0583 3.8991 5.8840 2.0020 4.6055 2.7935 1.8130 1.6149 1.9677 2.4848 1.7516 3.2922 1.1267 2.7161 3.0216 3.4675 2.5411 2.9591 3.9734 2.0300 2.8592 2.9987 2.6310 4.4500 2.4708 6.4049 3.1773 3.6161 2.9112 1.2308 1.3790 2.4515 2.1277 1.4815 2.0537 1.7270 1.6279 3.3691 2.0190 1.5996 1.7415 2.0557 1.5589 2.2289 1.3693 1.7379 2.1572 2.1401 1.9495 2.3463 1.8427 2.0661 2.2188 1.7697 2.7921 1.9933 1.3894 1.4894 2.3208 1.1237 1.9217 2.0379 1.3348 1.2907 2.7751 1.4993 1.2461 1.2070 1.2043 1.2139 1.3892 1.2490 1.2494 1.2903 1.4025 1.4357 1.5196 1.5863 1.4969 1.2602 1.2147 5.6897 1.4686 2.7664 1.0891 1.0900 1.0734 1.0718 1.0855 1.0522 1.0498 1.0565 1.0606 2.8431 6.6375 6.4336 1.0718 1.0707 1.0808 1.0840 1.0817 1.0599 1.0595 1.0376 1.0596 1.0366 1.1011 1.1016 1.0883 1.1014 1.0994 1.0892 1.0994 1.0998 1.0976 1.0866 1.0965 1.0883 1.0629 1.0964 1.0659
irintensity: 0.7032 0.1706 0.3215 0.8414 0.1854 0.4357 0.3319 0.1643 1.1683 2.7512 0.6548 0.3230 0.1073 0.8909 3.0786 2.0826 4.1913 142.7755 2.6442 11.3744 9.8424 4.8407 0.5968 3.5948 0.3865 1.0640 2.4074 22.3480 8.5690 9.0023 0.9922 1.2693 2.2497 17.5698 43.3781 12.7927 61.3712 33.1473 1.0765 6.0551 0.7026 27.6441 7.9045 3.7767 8.0944 13.2731 30.7671 13.3568 38.2461 4.9928 0.2006 5.4815 5.0911 4.7261 4.7053 36.2440 20.6928 26.0213 12.1073 16.2511 16.8640 232.3538 11.8214 16.9930 6.7363 14.6163 32.5739 4.8604 12.3368 24.5002 38.1597 9.6889 11.1011 2.5187 7.5502 6.6020 35.1749 31.1084 6.2997 2.8053 3.5997 0.8228 2.1713 21.1216 19.5073 18.9350 17.3763 60.4351 16.8392 4.0021 10.6916 4.5784 10.9414 13.2234 2.1195 13.0763 14.4871 6.9593 96.0352 8.6898 30.6865 39.9183 106.3304 39.1365 84.4500 20.5126 26.3836 45.7868 30.4738 42.7510 15.7700 14.6341 46.5216 27.6891 78.6905 57.1098 27.3484 60.3393 21.1870 26.2837 21.4276 20.2989 4.4019 277.8603 2.4182 36.9322
temp: 298.150 k
press: 1.00000 atm
elementType: 8 8 7 6 6 6 6 6 6 6 6 6 6 6 6 6 6 6 6 1 1 1 1 1 1 1 1 1 1 1 1 1 1 1 1 1 1 1 1 1 1 1 1 1
symmnumber: 1
zpe: 999956.0 jmol-1
zpe.correction: 0.380863 hartree
zpe.thermalcorrener: 0.400320 hartree
zpe.thermalcorrenthalpy: 0.401265 hartree
zpe.thermalcorrgfe: 0.332035 hartree
zpe.sumelectzpe: -828.402793 hartree
zpe.sumelectthermal: -828.383336 hartree
zpe.sumelectthermalent: -828.382391 hartree
zpe.sumelectthermalfe: -828.451621 hartree
dipole: 2.6846 -0.6884 -3.9367
dipole: 4.8145
quadrupole: -111.4980 -113.6174 -117.7554
quadrupole: 7.3979 11.1468 4.8254
quadrupole: 2.7923 0.6729 -3.4652 7.3979 11.1468 4.8254
hfenergy: -828.7836561 hartree
pointgroup: C01 [X(C16H25N1O2)]
dipole: -1.0259944 -0.4781091 1.5187394 debye
polarizability: 265.339759|4.7883666|152.5787834|4.4306198|-15.9225219|144.9850996 unknown
InChI: InChI=1S/C16H25NO2/c1-3-13-8-10-17(11-9-13)12(2)16(19)14-4-6-15(18)7-5-14/h4-7,12-13,16,18-19H,3,8-11H2,1-2H3
charge 0 multiplicity 1
44 atoms
O  0.283809 0.267059 -1.689149
O  6.490396 0.131459 -0.058645
N  -1.466129 0.246025 0.306141
C  -4.435515 -0.028901 0.262988
C  -3.703879 1.332986 0.173373
C  -3.484941 -1.137279 -0.252766
C  -2.332285 1.312958 0.877774
C  -2.118457 -1.087619 0.45794
C  -0.022124 0.218113 0.742273
C  -5.784664 0.013192 -0.496455
C  0.7667 -0.402659 -0.486978
C  0.528676 1.604223 1.119334
C  -6.655884 -1.250866 -0.3257
C  2.276801 -0.280635 -0.378286
C  2.992304 -1.092355 0.534888
C  2.997215 0.641059 -1.177814
C  4.393521 -0.97511 0.669843
C  4.395834 0.765748 -1.059257
C  5.093132 -0.039947 -0.130537
H  -4.650213 -0.234493 1.336257
H  -4.327374 2.131484 0.622357
H  -3.551666 1.59356 -0.893762
H  -3.330105 -1.007027 -1.34295
H  -3.929861 -2.138869 -0.098744
H  -1.838385 2.288073 0.742006
H  -2.483366 1.160466 1.976465
H  -2.253971 -1.325774 1.543287
H  -1.450982 -1.859374 0.035542
H  0.103167 -0.461263 1.618329
H  -5.583341 0.182444 -1.574857
H  -6.358101 0.896221 -0.146338
H  0.511094 -1.486534 -0.534579
H  1.58679 1.505039 1.412768
H  0.48561 2.30091 0.262434
H  -0.014674 2.046613 1.971871
H  -6.162285 -2.147508 -0.742453
H  -6.865539 -1.447169 0.743176
H  -7.626096 -1.136717 -0.842981
H  -0.68229 0.45567 -1.444298
H  2.459654 -1.831955 1.146207
H  2.440626 1.241177 -1.903091
H  4.934309 -1.612061 1.382619
H  4.96081 1.469817 -1.677657
H  6.883981 -0.485582 0.606923
