program: Gaussian 09
title: 000211489
version: EM64L-G09RevD.01
frameworkgroup: C1[X(C15H23NO2)]
method: RPBEPBE
basis: SDD
operation: Freq
keyword: #p
keyword: freq=noraman
keyword: PBEPBE/SDD
title: #p freq=noraman PBEPBE/SDD
converged: YES YES NO NO
title: Mulliken charges:
elementType: O O N C C C C C C C C C C C C C C C H H H H H H H H H H H H H H H H H H H H H H H
charge: -0.466303 -0.437073 -0.179714 -0.008060 -0.419182 -0.430231 -0.382919 -0.357148 -0.032661 -0.215253 -0.727113 -0.775965 0.433964 -0.397952 -0.368177 -0.392091 -0.349496 0.278583 0.192618 0.198588 0.195560 0.195821 0.203629 0.238008 0.180818 0.187423 0.217793 0.201692 0.193887 0.211276 0.213081 0.212998 0.251516 0.229802 0.226504 0.353446 0.226604 0.284486 0.214522 0.246836 0.349884
chargesum: 0.00000
title: Mulliken charges with hydrogens summed into heavy atoms:
elementType: O O N C C C C C C C C C C C C C C C
charge: -0.112857 -0.087189 -0.179714 0.184557 -0.025034 -0.030781 0.035907 0.048068 0.169031 -0.021366 -0.089758 -0.068143 0.433964 -0.171348 -0.083691 -0.177569 -0.102660 0.278583
polarizability: 2.48974745e+02 -3.06978309e+00 1.44189547e+02 7.09603394e+00 1.58490002e+01 1.35895004e+02
1716.lowfreq: -24.1622 -0.0006 -0.0006 0.0004 7.0748 8.4748 25.2245 40.2314 41.6635
frequency: 21.3351 40.2250 41.5301 66.8631 77.9264 141.4834 163.4027 190.3707 197.4011 209.3051 235.4709 255.9723 259.4078 293.9184 316.2956 344.4660 350.0988 361.6468 375.9899 383.2174 411.7444 429.0222 437.4569 460.8607 472.9241 519.0651 543.5341 599.8981 631.7837 654.9416 715.2454 734.7877 743.2056 779.5683 790.7595 799.7311 804.4479 816.5328 853.4002 861.7945 893.9034 925.9426 933.9248 954.2258 963.8231 973.1143 984.0635 989.6860 1004.8599 1006.4224 1050.2379 1074.8099 1090.9585 1100.1601 1104.3211 1113.4971 1134.0547 1141.7494 1143.0732 1157.6224 1172.3850 1199.0798 1206.4721 1237.6892 1242.8621 1247.0622 1260.7940 1274.8782 1276.2588 1289.9415 1308.7517 1311.3465 1317.0673 1332.0475 1343.5128 1346.6399 1358.1717 1375.3104 1388.0455 1393.8520 1396.5227 1402.7197 1424.6368 1447.8206 1459.6784 1465.6892 1474.0036 1476.8392 1477.8332 1479.5838 1490.4990 1503.9321 1599.6244 1626.8983 2860.3871 2866.3560 2893.6971 2911.8368 2943.4219 2967.0906 2972.3902 2979.0197 2992.8471 3033.2158 3040.1013 3045.5903 3063.0295 3066.6923 3074.1874 3088.6685 3097.3004 3103.4736 3127.7220 3156.0244 3176.6297 3181.9490 3582.8384
redmass: 4.4120 4.0457 3.7006 3.7153 3.8051 3.7569 5.9577 2.8500 3.4022 1.1708 2.0359 2.1660 2.3168 2.0987 2.5433 1.1124 2.4485 3.4932 2.5681 3.4964 2.9820 2.0096 3.9605 2.7029 2.9198 2.7003 4.7719 2.4219 6.4785 3.1247 3.6611 2.8997 1.2057 2.7741 2.2416 1.9913 1.5012 2.1507 1.6046 3.3809 1.9331 1.4301 1.8033 1.5476 1.3208 2.4256 1.4416 2.0358 2.5464 1.7221 2.1655 1.8066 2.1441 2.2421 1.7834 2.7867 2.0436 1.3836 1.3661 2.2305 1.1249 2.0051 2.0689 1.3048 2.7995 1.4356 1.3063 1.2982 1.2484 1.2551 1.3365 1.2728 1.2372 1.2743 1.4957 1.4429 1.6316 1.4990 1.2190 1.2881 5.5710 1.4483 2.7675 1.0897 1.0917 1.0744 1.0473 1.0804 1.0623 1.0533 1.0563 2.8308 6.6483 6.4226 1.0719 1.0709 1.0811 1.0843 1.0823 1.0374 1.0587 1.0599 1.0368 1.1020 1.1010 1.0892 1.0991 1.0994 1.0891 1.0998 1.0977 1.0867 1.0966 1.0883 1.0963 1.0631 1.0659
irintensity: 0.7122 0.3857 0.1225 0.4768 0.7252 0.8066 0.3121 2.1636 1.3726 0.0259 0.3586 4.0235 0.5532 1.1687 2.6399 141.3006 6.7907 5.2577 12.6536 8.1587 0.4215 2.2324 3.6855 1.8551 0.7372 21.8034 10.8650 7.3703 0.8587 0.7919 2.9917 17.9339 56.6923 52.5023 7.5648 31.6595 1.3578 5.8474 28.1295 7.7489 1.7685 5.1398 34.4849 6.0391 7.9817 38.6971 4.1162 8.1899 3.6351 1.4075 5.4336 35.2187 43.1730 16.6195 7.2058 17.3555 12.0315 228.7278 11.5472 19.6390 7.1926 43.5298 12.8200 14.6646 27.1215 27.3847 4.8768 5.7256 12.6605 19.6883 0.8253 4.3201 54.7876 4.1417 7.6772 1.8477 4.0838 9.6081 12.4060 30.9174 16.7370 57.8228 17.1962 3.5740 13.5575 5.2949 21.1670 11.3472 7.5373 4.2716 8.2716 96.3145 8.8749 30.3586 36.5341 111.3029 39.8707 85.4841 23.2892 28.2215 43.8426 49.1861 16.2439 37.2658 42.4616 34.4732 73.8785 40.5541 28.9041 20.0750 26.6857 21.3548 20.2507 4.0799 11.3043 246.8451 36.8599
temp: 298.150 k
press: 1.00000 atm
elementType: 8 8 7 6 6 6 6 6 6 6 6 6 6 6 6 6 6 6 1 1 1 1 1 1 1 1 1 1 1 1 1 1 1 1 1 1 1 1 1 1 1
symmnumber: 1
zpe: 926869.0 jmol-1
zpe.correction: 0.353026 hartree
zpe.thermalcorrener: 0.371031 hartree
zpe.thermalcorrenthalpy: 0.371975 hartree
zpe.thermalcorrgfe: 0.306645 hartree
zpe.sumelectzpe: -789.180607 hartree
zpe.sumelectthermal: -789.162602 hartree
zpe.sumelectthermalent: -789.161658 hartree
zpe.sumelectthermalfe: -789.226988 hartree
dipole: 2.6089 -1.4254 -3.7726
dipole: 4.8032
quadrupole: -103.4791 -105.8125 -112.6504
quadrupole: 7.8081 8.3958 4.1167
quadrupole: 3.8349 1.5015 -5.3364 7.8081 8.3958 4.1167
hfenergy: -789.5336331 hartree
pointgroup: C01 [X(C15H23N1O2)]
dipole: -1.000354 -0.5677912 1.499309 debye
polarizability: 249.0140366|4.5050479|144.1270182|5.9846145|-15.8407554|135.9182409 unknown
InChI: InChI=1S/C15H23NO2/c1-11-7-9-16(10-8-11)12(2)15(18)13-3-5-14(17)6-4-13/h3-6,11-12,15,17-18H,7-10H2,1-2H3
charge 0 multiplicity 1
41 atoms
O  -0.073822 0.260417 -1.708086
O  6.104686 0.228738 0.039124
N  -1.861189 0.119055 0.259448
C  -4.811561 -0.278513 0.20373
C  -4.144847 1.115439 0.126794
C  -3.817252 -1.335001 -0.334177
C  -2.774929 1.144112 0.836757
C  -2.457302 -1.244064 0.383489
C  -0.422339 0.140179 0.714251
C  0.404588 -0.427668 -0.514163
C  -6.15713 -0.316302 -0.549504
C  0.070082 1.539425 1.12079
C  1.908697 -0.270744 -0.373562
C  2.626344 -1.092835 0.528671
C  2.62144 0.691985 -1.130507
C  4.021575 -0.947474 0.694002
C  4.014286 0.84539 -0.981051
C  4.713426 0.027738 -0.064228
H  -5.001469 -0.50584 1.276254
H  -4.003045 1.391839 -0.937658
H  -4.80286 1.881603 0.582408
H  -4.231394 -2.354297 -0.205096
H  -3.664939 -1.174539 -1.420312
H  -2.320444 2.139927 0.713323
H  -2.925386 0.974798 1.933059
H  -2.587054 -1.509062 1.463372
H  -1.756045 -1.978351 -0.050513
H  -0.281922 -0.548954 1.580421
H  0.179175 -1.516119 -0.595448
H  -6.011531 -0.092511 -1.623938
H  -6.632375 -1.312388 -0.474506
H  -6.866092 0.429342 -0.14316
H  1.127629 1.475674 1.425934
H  0.010137 2.247413 0.2745
H  -0.500596 1.946223 1.973103
H  -1.051711 0.404157 -1.484475
H  2.100164 -1.863066 1.106893
H  2.065007 1.301314 -1.848234
H  4.563996 -1.593526 1.397294
H  4.57381 1.581366 -1.566394
H  6.500592 -0.399887 0.692395
