program: Gaussian 09
title: 000211487
version: EM64L-G09RevD.01
frameworkgroup: C1[X(C20H24Cl2N2O2)]
method: RPBEPBE
basis: SDD
operation: Freq
keyword: #p
keyword: freq=noraman
keyword: PBEPBE/SDD
title: #p freq=noraman PBEPBE/SDD
converged: YES YES NO NO
title: Mulliken charges:
elementType: Cl Cl O O N N C C C C C C C C C C C C C C C C C C C C H H H H H H H H H H H H H H H H H H H H H H H H
charge: -0.008098 -0.047613 -0.246251 -0.249842 -0.088231 -0.354847 -0.343606 -0.390359 -0.313115 -0.391408 -0.680721 -0.698404 0.133519 0.216661 0.341223 -0.374702 -0.462261 -0.313771 0.487618 -0.107257 -0.228762 -0.360250 -0.456520 -0.235345 -0.220095 -0.233399 0.257093 0.180160 0.219889 0.225702 0.186894 0.198690 0.220735 0.259330 0.316862 0.226665 0.215627 0.219079 0.229180 0.218119 0.211815 0.282015 0.226898 0.228895 0.284545 0.304545 0.230340 0.228394 0.226522 0.227843
chargesum: 0.00000
title: Mulliken charges with hydrogens summed into heavy atoms:
elementType: Cl Cl O O N N C C C C C C C C C C C C C C C C C C C C
charge: -0.008098 -0.047613 -0.246251 -0.249842 -0.088231 -0.037985 0.093648 0.055232 0.072469 0.088656 -0.019350 -0.039290 0.133519 0.216661 0.341223 -0.092687 -0.006468 -0.313771 0.487618 -0.107257 0.055783 -0.055705 -0.226180 -0.006951 0.006428 -0.005556
polarizability: 3.11636863e+02 -3.74825657e+01 3.04853781e+02 -1.95339281e+01 -8.65823935e+00 1.76129122e+02
1716.lowfreq: -0.0013 -0.0007 0.0003 3.7509 4.3811 5.5559 13.2262 24.1536 27.9950
frequency: 13.1302 24.0964 27.6835 32.0628 34.6727 41.3939 62.8257 64.5178 68.3759 89.1650 97.7686 102.4255 109.3714 136.5073 158.6002 168.1800 174.4628 185.8322 201.1238 219.4033 233.9362 254.5730 275.4893 279.9354 292.9223 301.8830 312.3036 346.2844 371.9100 394.3550 401.9309 405.4693 407.0270 413.0659 472.7098 487.9372 507.1693 525.6136 552.6863 565.8504 574.8512 592.2090 617.2971 674.9247 699.6710 706.0551 721.5729 745.6698 753.4534 765.9324 771.2955 780.6598 801.6686 808.7116 824.7729 860.4729 861.5066 866.7093 890.3806 899.4644 906.7454 926.4669 975.6442 977.3224 984.7620 990.3548 996.8463 1006.0635 1028.0913 1029.6499 1055.2318 1068.8828 1076.6663 1086.9395 1089.3303 1092.8306 1117.8889 1134.1557 1172.5818 1179.2179 1189.4503 1192.7627 1194.4485 1206.3002 1216.5472 1229.6802 1248.6635 1265.3271 1284.0513 1299.0550 1318.8287 1327.6674 1336.3550 1342.1267 1346.8043 1355.2654 1369.1404 1372.2481 1380.7941 1381.8702 1386.8371 1387.7708 1423.9540 1442.8156 1443.8738 1458.6192 1467.9445 1472.8192 1474.2169 1477.7279 1479.6608 1483.5057 1487.2431 1492.6753 1500.5688 1549.3478 1579.4933 1593.7066 1598.6524 1617.1379 2857.2772 2876.3326 2977.4399 2983.0953 2985.1822 2995.8401 3007.0309 3024.2949 3041.3105 3041.8427 3046.8257 3073.7764 3077.7246 3081.0176 3090.3601 3097.4821 3117.5484 3126.8832 3140.1484 3151.4289 3160.4385 3163.5046 3184.1093 3546.1395
redmass: 5.0320 6.9042 3.5386 4.3581 5.8351 5.1084 3.9224 2.8503 4.8375 3.2815 4.2187 3.7469 5.1228 7.8942 5.7112 1.8929 7.2559 4.0708 3.0071 1.4590 2.9187 3.0794 3.4491 2.4305 2.0020 3.9829 3.4277 6.9427 4.6689 5.6877 2.7308 2.8507 7.7765 3.8266 3.8758 2.8368 4.4266 3.5756 1.6409 2.1186 4.8086 5.1338 6.2953 5.9602 3.2788 2.3393 4.3071 2.4321 2.1547 3.5109 1.1448 2.4410 2.2150 1.6200 3.5963 1.2786 3.1066 1.4104 1.4361 2.0874 3.6078 1.7252 2.4933 1.6898 1.4962 4.8725 5.0638 1.3618 2.2545 3.4991 2.3937 2.0194 1.9698 2.0547 1.7262 1.9692 1.6429 4.6832 1.0572 1.7292 1.1887 1.1710 1.6680 2.0637 3.0211 2.2610 1.7415 1.6196 1.2483 1.1334 1.2881 1.3339 1.3382 1.2302 1.6999 4.7426 1.3375 1.2997 1.3454 3.1483 1.2531 5.4489 2.7390 1.6959 1.4091 1.0665 1.0499 1.1138 1.0832 1.3034 1.2712 1.0995 2.3305 1.0771 1.0811 7.7362 7.9575 6.4339 6.9867 5.9010 1.0714 1.0705 1.0349 1.0556 1.0361 1.0612 1.0858 1.0618 1.1064 1.0978 1.0922 1.0988 1.1001 1.1002 1.1006 1.1053 1.0867 1.0874 1.0921 1.0964 1.0923 1.1017 1.0935 1.0782
irintensity: 0.0697 0.1792 0.1382 0.1130 0.0793 0.3529 2.0308 0.6811 1.8999 2.9805 4.4156 1.9629 3.9134 5.0845 2.4816 1.1913 3.2360 0.0928 0.8024 0.8578 0.4325 0.9798 0.6175 3.7956 1.2726 3.1382 2.0827 1.8737 15.4912 7.3904 4.3727 0.3055 4.1500 0.6145 6.0167 4.8149 21.6828 6.7052 77.2284 26.6117 0.5792 8.2490 0.7347 39.2043 9.0708 55.4083 38.0431 2.5596 50.3444 9.3968 2.6006 50.5486 16.2696 28.7751 9.0291 3.8120 5.8590 23.8134 10.2652 11.6456 84.4209 11.2456 7.7561 5.7895 1.9733 0.2754 11.1994 2.2464 12.0856 9.8665 10.1814 25.0127 39.8912 23.6540 17.6562 2.4108 7.4564 54.7793 0.1590 36.9818 10.6807 15.6477 15.3207 22.9851 212.2690 1.8481 63.0592 94.2930 9.3077 21.3857 5.2603 40.4161 1.7691 5.8456 73.0491 16.6840 2.1367 8.5211 10.3208 19.4735 25.7667 4.8829 128.0869 14.8765 37.7627 16.4682 9.5852 11.6347 6.8240 110.4933 97.8780 45.2627 20.4243 14.2921 0.6835 41.1063 40.9204 30.0303 91.5797 0.2786 70.8185 94.5203 22.4462 32.8480 28.7734 43.4106 23.8085 31.7891 20.9673 6.5642 16.8525 37.9708 71.9127 46.6816 40.7963 13.1563 5.7303 4.9585 25.3685 9.1711 0.2598 38.7384 0.9549 23.5981
temp: 298.150 k
press: 1.00000 atm
elementType: 17 17 8 8 7 7 6 6 6 6 6 6 6 6 6 6 6 6 6 6 6 6 6 6 6 6 1 1 1 1 1 1 1 1 1 1 1 1 1 1 1 1 1 1 1 1 1 1 1 1
symmnumber: 1
zpe: 1049427.6 jmol-1
zpe.correction: 0.399706 hartree
zpe.thermalcorrener: 0.426891 hartree
zpe.thermalcorrenthalpy: 0.427835 hartree
zpe.thermalcorrgfe: 0.337930 hartree
zpe.sumelectzpe: -1954.637876 hartree
zpe.sumelectthermal: -1954.610691 hartree
zpe.sumelectthermalent: -1954.609747 hartree
zpe.sumelectthermalfe: -1954.699653 hartree
dipole: -3.5325 -2.2433 -3.7096
dipole: 5.5921
quadrupole: -167.4871 -162.0019 -169.2913
quadrupole: -3.0426 -1.1053 1.1120
quadrupole: -1.2270 4.2582 -3.0312 -3.0426 -1.1053 1.1120
hfenergy: -1955.0375822 hartree
pointgroup: C01 [X(C20H24Cl2N2O2)]
dipole: -1.4244324 -0.7613595 -1.4939099 debye
polarizability: 303.8400998|-37.4131572|313.3738084|-13.5519139|-13.0734804|175.4058582 unknown
InChI: InChI=1S/C20H24Cl2N2O2/c1-3-24(4-2)11-10-23-20(25)17-12-16(21)13-18(22)19(17)26-14-15-8-6-5-7-9-15/h5-9,12-13,23H,3-4,10-11,14H2,1-2H3
charge 0 multiplicity 1
50 atoms
Cl 4.983824 1.35064 -0.496726
Cl 4.938492 -4.126111 0.373862
O  2.069923 1.181146 0.051139
O  0.00377 -0.488584 1.641933
N  -4.021878 -1.562842 -0.10324
N  -0.280845 -2.2338 0.131101
C  -2.581958 -1.309183 -0.314147
C  -4.825543 -0.352383 0.202933
C  -4.602201 -2.487309 -1.10812
C  -1.722547 -2.382102 0.410601
C  -5.011443 0.659154 -0.961105
C  -5.96506 -3.070775 -0.691283
C  0.489608 -1.282537 0.777439
C  1.955929 -1.287347 0.398093
C  2.657977 -0.079788 0.095203
C  2.658219 -2.517671 0.470411
C  0.917735 1.398086 -0.88416
C  4.063551 -0.157774 -0.1025
C  0.145314 2.610401 -0.422388
C  4.047379 -2.541731 0.263782
C  4.773336 -1.369814 -0.01496
C  -0.440438 2.632736 0.870389
C  -0.021191 3.720861 -1.284846
C  -1.185507 3.757114 1.28553
C  -0.776273 4.842286 -0.870335
C  -1.359789 4.861864 0.416755
H  -2.316072 -0.323136 0.10765
H  -2.303922 -1.288008 -1.396577
H  -5.816894 -0.6788 0.567753
H  -4.336735 0.15792 1.054154
H  -4.696474 -2.006246 -2.114913
H  -3.888491 -3.324703 -1.234349
H  -2.035568 -3.39626 0.105204
H  -1.885248 -2.282445 1.496579
H  0.145683 -2.787061 -0.614423
H  -4.037644 1.037676 -1.322893
H  -5.545762 0.206561 -1.816777
H  -5.602145 1.528623 -0.617572
H  -5.892298 -3.535792 0.30778
H  -6.754294 -2.298698 -0.656084
H  -6.287382 -3.840466 -1.416481
H  2.127618 -3.436144 0.738759
H  1.339755 1.548842 -1.896169
H  0.279939 0.493897 -0.892552
H  5.854727 -1.393143 -0.1689
H  -0.294029 1.774099 1.535043
H  0.444967 3.713874 -2.278101
H  -1.630019 3.774336 2.287067
H  -0.900251 5.697905 -1.543517
H  -1.939741 5.732631 0.743452
