program: Gaussian 09
title: 000211485
version: EM64L-G09RevD.01
frameworkgroup: C1[X(C20H24ClN3O3)]
method: RPBEPBE
basis: SDD
operation: Freq
keyword: #p
keyword: freq=noraman
keyword: PBEPBE/SDD
title: #p freq=noraman PBEPBE/SDD
converged: YES YES NO NO
title: Mulliken charges:
elementType: Cl O O O N N N C C C C C C C C C C C C C C C C C C C C H H H H H H H H H H H H H H H H H H H H H H H H
charge: -0.072445 -0.248711 -0.342017 -0.306294 -0.095016 -0.389292 -0.684159 -0.338013 -0.348874 -0.323555 -0.320691 -0.313623 -0.406139 0.146741 0.088304 0.329815 -0.364409 -0.537583 0.677957 -0.380134 -0.433244 0.456637 -0.371220 -0.428727 -0.225708 -0.221268 -0.229730 0.196672 0.218635 0.189753 0.205296 0.193269 0.219130 0.191699 0.214450 0.210045 0.190097 0.247649 0.228008 0.368955 0.303295 0.244391 0.222308 0.220709 0.246719 0.235849 0.310079 0.324165 0.232589 0.232819 0.234818
chargesum: 0.00000
title: Mulliken charges with hydrogens summed into heavy atoms:
elementType: Cl O O O N N N C C C C C C C C C C C C C C C C C C C C
charge: -0.072445 -0.248711 -0.342017 -0.306294 -0.095016 -0.020336 -0.049915 0.077294 0.046175 0.088845 0.085458 0.086519 0.069518 0.146741 0.088304 0.329815 -0.061114 -0.293192 0.677957 -0.380134 0.009772 0.456637 -0.124501 -0.192879 0.006881 0.011551 0.005088
polarizability: 3.55015147e+02 4.12393638e+01 2.84938324e+02 -5.21313078e+00 -9.89293881e+00 1.64016333e+02
1716.lowfreq: -0.0022 -0.0007 -0.0002 1.0711 1.9887 4.9010 12.6975 22.0542 22.9544
frequency: 11.3686 21.7005 22.8951 27.2504 28.8015 40.3722 54.8923 71.3394 73.3700 94.8236 98.3226 133.2608 145.4861 159.3744 190.0638 214.1435 231.3938 243.7194 251.6259 261.1990 291.6206 308.9494 326.0381 341.1674 354.7587 366.2848 375.5131 387.1359 397.0949 401.7498 410.1339 434.2630 445.5179 470.6881 487.3712 489.6337 501.7807 562.9238 596.6052 599.5778 616.9124 623.8184 634.0880 666.9385 696.6729 702.2874 711.9929 729.5158 744.3943 755.5573 764.2514 770.2815 806.5490 828.2111 830.0773 840.8900 844.5596 854.7010 899.0389 915.7976 937.8174 941.5654 978.6260 989.8277 991.8864 998.0631 1000.8759 1001.4781 1017.2778 1027.2757 1028.3618 1041.6244 1052.1798 1055.4683 1072.7945 1090.7731 1091.3311 1110.5808 1123.8841 1135.1743 1165.5781 1169.7565 1174.8692 1188.6130 1190.2131 1194.8456 1222.0272 1226.1134 1244.1838 1254.7342 1263.7476 1273.2863 1293.8592 1303.5617 1314.5798 1322.3364 1325.3905 1334.9681 1351.0703 1351.7299 1369.3082 1373.3775 1385.3256 1389.9272 1390.7727 1426.8528 1442.9002 1444.6258 1445.0315 1450.2065 1452.2220 1460.2213 1477.6341 1480.3173 1487.3162 1502.6616 1522.9045 1549.9976 1590.5290 1597.3313 1616.4921 1617.6551 1640.6305 2862.0587 2873.2782 2896.3390 2952.4471 2958.5452 2964.4126 3013.0752 3021.0475 3022.8551 3028.0735 3049.4502 3077.3200 3083.0664 3091.3472 3123.8148 3127.7782 3139.8417 3152.1094 3155.9154 3158.7096 3168.0740 3460.8445 3548.6073 3697.7761
redmass: 6.2437 4.1470 4.6205 4.5584 3.9466 5.7581 5.6890 4.0143 5.0936 5.7516 4.5778 6.7420 3.3991 6.8750 5.1809 6.4016 3.5747 2.0958 3.9136 3.4871 4.1570 3.1991 2.5653 3.6353 6.2788 3.9594 2.7929 3.2898 1.5343 2.7983 2.4373 5.5113 2.4865 2.8046 1.7922 1.9505 4.6912 5.5952 3.4817 3.0583 5.6158 3.8814 8.3411 4.8822 2.8865 1.8765 1.1602 3.7735 3.9893 1.6326 2.2112 3.8203 3.7200 2.4126 2.6322 1.8761 2.3450 1.2501 2.3294 2.0462 2.8096 1.3716 1.3944 2.9687 2.3609 2.7797 1.5971 2.1909 5.3119 2.1749 2.2014 3.3242 1.8018 1.8329 2.3789 1.5134 3.1028 2.4186 4.9411 2.6639 2.3820 2.0910 1.0546 1.1169 1.0642 1.0982 1.2569 2.1859 2.0709 1.6151 1.3457 1.3367 1.2582 1.2267 3.0092 1.3666 1.3181 1.2459 1.3219 1.5171 1.3413 1.2946 6.2161 1.3818 4.6092 5.1415 2.1951 1.0832 1.1112 1.0931 1.1000 1.0983 1.0954 1.1548 2.3653 2.9338 2.2401 6.8905 5.7570 6.1191 2.2884 3.7155 2.3010 1.0699 1.0703 1.0679 1.0663 1.0665 1.0563 1.0910 1.0612 1.0889 1.1071 1.0892 1.0966 1.0976 1.1039 1.0873 1.0871 1.0917 1.0963 1.0900 1.0916 1.1016 1.0800 1.0458 1.1032
irintensity: 0.3083 1.8337 1.2685 0.0123 0.2566 0.8369 4.3904 0.1670 0.4696 1.4614 2.4961 0.7978 0.7922 0.1913 1.5873 0.2153 7.0473 2.5215 4.6717 3.9590 3.4523 5.2989 7.7436 23.0847 4.5994 23.7340 22.1450 21.9654 61.4157 0.3988 5.1565 5.1386 44.3552 0.8259 87.7061 45.7646 6.7734 0.3825 10.1750 4.5045 1.6392 4.8045 14.3294 51.4542 3.4741 57.9571 60.3813 22.9490 10.2727 17.7173 49.4887 3.7470 26.6210 48.5994 10.4697 6.7312 8.4274 0.0400 10.2611 58.3458 32.2568 13.9882 0.0104 0.6933 4.3553 28.0974 10.0658 24.2049 15.7716 4.2953 8.7491 3.7669 1.5941 24.5330 19.6161 6.7760 43.1279 4.1650 185.2743 85.8493 3.8544 66.3333 0.0508 0.0895 1.4244 3.5324 5.0213 7.8106 342.4113 2.9859 14.5281 9.9486 2.2920 11.5083 105.4436 13.8352 5.8388 7.2289 10.7947 33.4377 1.1267 7.0640 12.3839 4.0102 5.1816 36.0309 9.9899 4.3309 19.1379 6.2194 24.6156 14.5882 10.0388 17.3562 1.1044 291.0609 175.3483 15.1738 228.7564 1.4546 28.5729 7.3129 476.3301 62.4602 67.5112 86.5607 42.8836 98.5697 34.1726 13.4680 36.6313 66.7706 22.4124 31.0348 43.7281 36.2585 16.3413 5.9934 1.7644 11.5430 33.2112 6.9343 16.6495 18.8206 159.3425 124.1160 35.1105
temp: 298.150 k
press: 1.00000 atm
elementType: 17 8 8 8 7 7 7 6 6 6 6 6 6 6 6 6 6 6 6 6 6 6 6 6 6 6 6 1 1 1 1 1 1 1 1 1 1 1 1 1 1 1 1 1 1 1 1 1 1 1 1
symmnumber: 1
zpe: 1081149.6 jmol-1
zpe.correction: 0.411788 hartree
zpe.thermalcorrener: 0.437668 hartree
zpe.thermalcorrenthalpy: 0.438612 hartree
zpe.thermalcorrgfe: 0.351219 hartree
zpe.sumelectzpe: -1624.501978 hartree
zpe.sumelectthermal: -1624.476098 hartree
zpe.sumelectthermalent: -1624.475153 hartree
zpe.sumelectthermalfe: -1624.562547 hartree
dipole: -4.1462 8.5688 0.9058
dipole: 9.5622
quadrupole: -154.0525 -165.6298 -166.0945
quadrupole: -0.7656 -4.0669 -1.2021
quadrupole: 7.8731 -3.7042 -4.1689 -0.7656 -4.0669 -1.2021
hfenergy: -1624.9137657 hartree
pointgroup: C01 [X(C20H24Cl1N3O3)]
dipole: -1.1611045 -3.5089062 0.7018358 debye
polarizability: 363.4584456|-24.0902582|258.9027788|24.1715553|-40.8341092|181.6085803 unknown
InChI: InChI=1S/C20H24ClN3O3/c21-17-12-16(20(25)23-6-7-24-8-10-26-11-9-24)19(13-18(17)22)27-14-15-4-2-1-3-5-15/h1-5,12-13,23H,6-11,14,22H2
charge 0 multiplicity 1
51 atoms
Cl -5.83382 2.510665 -1.325738
O  6.242759 3.10687 -1.066355
O  -1.497391 -1.230369 0.601443
O  -0.658698 2.854925 -0.269718
N  3.789287 1.739751 -0.31357
N  0.192663 0.858682 0.564468
N  -6.181688 -0.438135 -0.662879
C  3.7963 3.192014 -0.637807
C  4.856712 1.04496 -1.077307
C  2.453716 1.119908 -0.477038
C  5.173638 3.79334 -0.318616
C  6.222715 1.66973 -0.747612
C  1.54114 1.407491 0.742937
C  -0.833151 1.630009 0.052153
C  -2.187324 0.982305 -0.100157
C  -2.533765 -0.381424 0.155297
C  -3.225854 1.835619 -0.553861
C  -3.850463 -0.854434 -0.028579
C  -4.884928 0.01347 -0.481252
C  -4.524529 1.367256 -0.738146
C  -1.770309 -2.680768 0.759138
C  -0.456464 -3.364266 1.061711
C  0.567174 -3.404147 0.079743
C  -0.232772 -3.975031 2.319305
C  1.794623 -4.044726 0.353922
C  0.993335 -4.623916 2.593316
C  2.009125 -4.659127 1.611286
H  3.560779 3.36218 -1.718489
H  3.022699 3.709492 -0.042584
H  4.686223 1.10811 -2.18223
H  4.865257 -0.024634 -0.792316
H  2.588998 0.024526 -0.569745
H  1.934219 1.46963 -1.401564
H  5.37054 3.71276 0.772276
H  5.22953 4.849472 -0.630134
H  7.025378 1.221467 -1.356884
H  6.443718 1.522529 0.332026
H  1.43903 2.496182 0.886888
H  2.00166 0.974587 1.6487
H  -0.008405 -0.122513 0.786983
H  -2.951675 2.876533 -0.754338
H  -4.107584 -1.896222 0.183062
H  -2.211627 -3.052734 -0.187725
H  -2.498705 -2.827657 1.580348
H  0.400083 -2.9292 -0.894323
H  -1.01533 -3.940496 3.086997
H  -6.43267 -1.404301 -0.478225
H  -6.897914 0.209343 -0.985044
H  2.579689 -4.071775 -0.409728
H  1.156195 -5.094968 3.568749
H  2.960282 -5.160062 1.822718
