program: Gaussian 09
title: 000216710
version: EM64L-G09RevD.01
frameworkgroup: C1[X(C19H31NO)]
method: RPBEPBE
basis: SDD
operation: Freq
keyword: #p
keyword: freq=noraman
keyword: PBEPBE/SDD
title: #p freq=noraman PBEPBE/SDD
converged: YES YES NO NO
title: Mulliken charges:
elementType: O N C C C C C C C C C C C C C C C C C C C H H H H H H H H H H H H H H H H H H H H H H H H H H H H H H H
charge: -0.442253 -0.037081 0.274060 -0.569949 -0.548655 -0.537057 -0.451716 0.509879 -0.024842 -0.343554 -0.389142 -0.523198 -0.459080 -0.695349 -0.703159 -0.013009 0.274486 -0.217822 -0.718699 -0.714544 -0.422721 0.216494 0.219959 0.241110 0.225706 0.208426 0.204798 0.218132 0.217876 0.183341 0.210092 0.185671 0.193003 0.205181 0.262825 0.221958 0.216475 0.204514 0.208826 0.242408 0.203006 0.210912 0.190226 0.222551 0.208993 0.205457 0.223123 0.211630 0.207330 0.210024 0.219922 0.353436
chargesum: 0.00000
title: Mulliken charges with hydrogens summed into heavy atoms:
elementType: O N C C C C C C C C C C C C C C C C C C C
charge: -0.088818 -0.037081 0.274060 -0.133496 -0.081839 -0.123833 -0.015708 0.509879 0.158499 0.052209 0.009043 -0.260373 -0.237122 -0.065535 -0.046833 0.177217 0.274486 0.004729 -0.081127 -0.085560 -0.202799
polarizability: 2.17219375e+02 1.07837710e+01 2.22363424e+02 5.52662225e+00 -6.77662447e+00 1.90943729e+02
1716.lowfreq: -10.8833 -4.4725 -0.0006 -0.0005 -0.0004 7.5102 17.5091 26.8546 31.0929
frequency: 16.6462 26.5069 31.0441 38.5581 48.6556 78.9275 88.7795 108.1115 138.5046 145.4418 169.5701 181.5970 206.9869 212.7505 224.9110 237.0876 249.3863 255.7336 268.8253 278.9617 292.3118 338.4278 349.3370 354.2616 371.6102 386.6623 387.5068 405.4291 424.0377 443.3340 461.8961 462.6251 485.4051 524.0972 549.9551 603.5318 627.0661 665.2056 697.4293 708.4657 755.3141 775.5423 777.6579 795.9437 813.6767 827.3624 855.6409 859.8486 874.1262 890.8307 899.6981 912.0168 914.5949 929.7825 937.1471 950.1623 956.2681 957.8667 960.8716 974.3697 985.3762 987.6907 1012.4564 1025.8182 1051.1360 1062.6170 1077.6166 1090.1331 1102.5817 1114.5367 1128.9964 1138.4978 1141.4020 1153.0469 1174.9415 1179.3786 1183.3261 1198.4023 1207.7364 1217.6745 1238.3780 1252.2068 1258.1457 1275.2875 1287.5833 1299.0869 1302.5188 1306.5723 1311.7017 1313.6638 1328.8521 1331.3557 1333.7623 1342.5373 1357.8307 1371.6469 1376.8365 1377.1830 1379.9198 1392.9013 1394.6139 1448.6245 1453.6999 1457.4449 1462.2224 1467.0203 1467.4471 1469.9667 1471.5698 1475.8465 1478.7121 1479.8451 1482.0223 1483.2084 1485.1220 1490.5486 1494.9609 1586.2021 1624.5580 2866.9179 2933.2289 2949.8100 2954.4109 2964.3586 2966.2806 2970.5994 2972.8669 2976.5785 2983.5062 2992.4489 3006.0050 3008.2227 3017.7946 3042.2613 3056.5892 3060.0019 3062.2185 3063.3992 3065.9500 3066.3832 3070.4215 3074.9525 3079.3560 3090.9915 3094.8297 3114.8170 3138.6270 3149.7724 3163.8431 3582.2935
redmass: 4.1120 2.6717 3.1269 3.4624 4.5674 3.3954 2.8116 2.9735 2.0100 2.9349 3.2572 2.9715 1.1420 2.8691 4.0271 1.2935 2.2504 1.1556 1.6846 1.3542 3.0175 2.4796 2.6040 1.1760 2.3688 2.0366 2.2438 2.4650 2.1380 2.6508 3.0000 3.0571 2.1526 6.1550 2.9815 4.6999 2.6910 4.3392 2.3702 2.8621 2.3480 1.7504 1.6800 2.1171 2.8049 2.4473 2.4076 1.5638 1.7933 1.5822 2.5308 1.2232 1.1704 1.7310 2.2291 1.5532 1.9863 1.3344 1.4520 1.8501 5.7229 2.0108 2.2067 2.8805 2.1524 2.4810 3.0241 1.7809 1.8783 1.6700 1.7762 1.9974 1.7106 1.4357 1.7763 1.8904 1.1311 1.5497 1.7575 1.6056 1.4321 1.8261 1.4612 1.2438 1.5376 1.2139 1.3134 1.2424 1.3714 1.4557 1.4844 1.4089 1.4298 1.4425 1.2858 1.3372 1.2466 1.2395 6.3048 1.2182 1.2186 1.2743 1.0779 1.6827 1.2062 1.0787 1.0528 1.1846 1.0539 1.0851 1.0693 1.7115 1.0864 1.0749 1.1030 1.0485 1.0617 6.2481 6.2690 1.0697 1.0751 1.0827 1.0676 1.0358 1.0446 1.0505 1.0359 1.0382 1.0661 1.0693 1.0870 1.0723 1.0932 1.0964 1.0995 1.0992 1.0996 1.0995 1.0987 1.0990 1.0987 1.0994 1.1023 1.0979 1.0956 1.0877 1.0916 1.0909 1.0957 1.0660
irintensity: 0.1076 0.0284 0.0556 0.0405 0.1153 1.0339 0.2092 0.0743 0.4835 0.5563 1.0779 1.8277 0.0320 3.4013 0.2288 0.0843 0.1367 0.1336 0.4076 0.2342 1.4101 2.2688 13.7468 119.0294 1.1492 1.5522 0.8424 4.6208 2.9370 6.3394 3.1100 0.7123 2.1786 1.3413 4.5507 1.0508 6.3560 0.6621 26.3041 30.7836 2.1795 44.4795 4.7991 4.5602 2.4341 1.6289 16.3053 5.2483 20.0701 9.5957 48.0362 0.8367 2.7488 6.8838 6.1742 5.6274 14.5343 0.1362 1.7545 7.5062 2.1828 7.1378 5.6123 8.2862 20.8870 2.8306 16.4909 12.5766 28.4515 2.3350 3.8433 9.4868 36.2313 126.0410 12.7618 8.4069 5.4817 1.0323 12.3829 2.1008 4.3884 23.5857 6.3018 0.1842 8.7125 2.3157 23.8613 7.7190 5.1549 3.5844 3.0721 2.5418 2.5758 3.2333 7.0765 14.8573 15.9339 13.2943 7.9442 11.9022 14.2647 8.3517 1.8990 3.8128 19.1176 0.7356 1.6618 25.5396 3.2696 15.5156 20.0045 23.4524 7.4908 17.2053 5.1875 20.2787 10.4940 63.6121 71.5442 67.3313 14.1245 18.1185 66.8774 36.1928 34.7902 30.9514 40.1391 18.4303 51.8819 58.9186 33.3014 45.9920 6.9824 35.4840 6.5873 23.5356 12.1084 69.5243 84.9622 71.6586 68.8552 35.7328 43.7460 26.6791 41.9192 11.3720 21.4183 6.3488 14.6532 33.7206
temp: 298.150 k
press: 1.00000 atm
elementType: 8 7 6 6 6 6 6 6 6 6 6 6 6 6 6 6 6 6 6 6 6 1 1 1 1 1 1 1 1 1 1 1 1 1 1 1 1 1 1 1 1 1 1 1 1 1 1 1 1 1 1 1
symmnumber: 1
zpe: 1205530.8 jmol-1
zpe.correction: 0.459162 hartree
zpe.thermalcorrener: 0.482278 hartree
zpe.thermalcorrenthalpy: 0.483222 hartree
zpe.thermalcorrgfe: 0.405675 hartree
zpe.sumelectzpe: -870.913186 hartree
zpe.sumelectthermal: -870.890071 hartree
zpe.sumelectthermalent: -870.889127 hartree
zpe.sumelectthermalfe: -870.966673 hartree
dipole: 0.7151 1.5569 -0.5132
dipole: 1.7884
quadrupole: -134.2880 -120.6370 -129.7910
quadrupole: 0.7171 -2.1297 -5.0941
quadrupole: -6.0493 7.6017 -1.5523 0.7171 -2.1297 -5.0941
hfenergy: -871.3723484 hartree
pointgroup: C01[X(C19H31N1O1)]
dipole: -0.3464835 -0.4706874 -0.391785 debye
polarizability: 221.2453797|9.9439835|211.9600625|1.9975352|15.1133343|197.3210858 unknown
InChI: InChI=1S/C19H31NO/c1-15(2)8-10-20-11-9-19(14-20,13-16(3)4)17-6-5-7-18(21)12-17/h5-7,12,15-16,21H,8-11,13-14H2,1-4H3
charge 0 multiplicity 1
52 atoms
O  -3.292319 -3.092145 0.237715
N  1.892619 1.308287 0.725563
C  -0.587378 1.016034 0.655361
C  0.653207 1.827947 0.091475
C  0.007087 0.466725 2.023192
C  -1.796601 1.966376 0.996299
C  1.449677 1.059413 2.126395
C  -1.053464 -0.161922 -0.22921
C  -2.638942 2.673973 -0.114357
C  2.492425 0.119324 0.056449
C  3.963626 -0.088899 0.47217
C  -1.930956 -1.120938 0.339432
C  -0.681286 -0.329794 -1.589907
C  -1.814277 3.490115 -1.139391
C  -3.637333 1.739259 -0.844798
C  4.599062 -1.392351 -0.081538
C  -2.42404 -2.199476 -0.422162
C  -1.176274 -1.413382 -2.349263
C  4.63393 -1.414181 -1.629678
C  6.022409 -1.583572 0.493934
C  -2.054589 -2.359153 -1.77933
H  0.754896 1.828022 -1.004061
H  0.535925 2.882599 0.406643
H  0.047851 -0.635658 2.0054
H  -0.617142 0.764524 2.885315
H  -2.512637 1.387196 1.61483
H  -1.383454 2.754921 1.661531
H  1.432243 2.025988 2.666776
H  2.151202 0.391526 2.654156
H  -3.257172 3.406928 0.450429
H  2.441856 0.300687 -1.03291
H  1.91913 -0.821963 0.248808
H  4.028492 -0.10651 1.579491
H  4.553635 0.788837 0.140326
H  -2.252524 -1.044572 1.383273
H  -0.004636 0.379151 -2.074153
H  -1.218674 2.828282 -1.793779
H  -1.124095 4.197431 -0.643764
H  -2.490484 4.076028 -1.790144
H  -3.122825 1.028122 -1.512822
H  -4.335893 2.338178 -1.460455
H  -4.236758 1.150717 -0.125348
H  3.973196 -2.246644 0.257851
H  -0.875457 -1.522547 -3.397344
H  5.134759 -2.328574 -1.999427
H  5.194938 -0.541169 -2.017081
H  3.619231 -1.388661 -2.066977
H  6.009902 -1.606032 1.599999
H  6.684106 -0.752616 0.181204
H  6.475547 -2.528024 0.138556
H  -2.437644 -3.198731 -2.373821
H  -3.586696 -3.811076 -0.374754
