program: Gaussian 09
title: 000211484
version: EM64L-G09RevD.01
frameworkgroup: C1[X(C20H26ClN3O2)]
method: RPBEPBE
basis: SDD
operation: Freq
keyword: #p
keyword: freq=noraman
keyword: PBEPBE/SDD
title: #p freq=noraman PBEPBE/SDD
converged: YES YES NO NO
title: Mulliken charges:
elementType: Cl O O N N N C C C C C C C C C C C C C C C C C C C C H H H H H H H H H H H H H H H H H H H H H H H H H H
charge: -0.073949 -0.345796 -0.304840 -0.085274 -0.388549 -0.684789 -0.343135 -0.395527 -0.387850 -0.310937 -0.687438 -0.699323 0.156163 0.079930 0.330874 -0.366143 -0.537938 0.679947 -0.425084 -0.380747 0.457248 -0.441900 -0.374684 -0.220067 -0.223134 -0.233754 0.250281 0.174869 0.254583 0.209598 0.215363 0.226852 0.177203 0.205201 0.373758 0.224801 0.214797 0.215690 0.230612 0.215063 0.207049 0.303216 0.242519 0.226287 0.220917 0.234801 0.251346 0.323654 0.309579 0.231836 0.232713 0.234111
chargesum: 0.00000
title: Mulliken charges with hydrogens summed into heavy atoms:
elementType: Cl O O N N N C C C C C C C C C C C C C C C C C C C C
charge: -0.073949 -0.345796 -0.304840 -0.085274 -0.014791 -0.051555 0.082014 0.068653 0.054366 0.071466 -0.032150 -0.046598 0.156163 0.079930 0.330874 -0.062927 -0.295419 0.679947 0.022119 -0.380747 0.457248 -0.207099 -0.123338 0.011769 0.009579 0.000356
polarizability: 3.70509882e+02 -2.28210347e+01 2.76420192e+02 1.04180628e+01 -1.31306838e+01 1.57938052e+02
1716.lowfreq: -8.9983 -3.5335 -0.0013 0.0017 0.0018 2.9018 6.6925 14.7656 20.7196
frequency: -6.3869 14.7036 20.6507 25.4596 26.6305 42.5502 57.0789 61.4847 72.2144 78.0983 89.4580 105.8469 131.1918 142.0030 158.3337 167.0894 198.1375 215.0425 228.3333 240.3199 244.4276 271.3376 284.3540 290.3899 296.8016 305.3956 347.0614 359.4801 382.9682 394.1138 397.5578 402.4484 408.4309 439.1422 446.1609 486.1305 486.8380 490.6323 526.1166 562.1218 596.8494 613.6292 620.7701 633.3163 666.8750 696.2580 699.1550 706.6812 730.5883 740.1676 748.9092 758.0801 761.0469 772.3430 803.5315 825.9835 828.3355 840.9249 854.5615 896.6673 916.2008 938.7083 941.9857 973.1007 978.3614 990.2401 996.3009 1000.7542 1001.9995 1011.9740 1026.7039 1029.9074 1051.8769 1054.6742 1068.9543 1076.8491 1089.6723 1090.2482 1116.1351 1123.7544 1170.7502 1174.6881 1185.5136 1188.7602 1194.4752 1206.0721 1224.9906 1242.1111 1251.8449 1261.0871 1282.7423 1296.5845 1313.9484 1319.0521 1322.7767 1334.7607 1342.1307 1352.7256 1365.7442 1370.1387 1378.8902 1384.0348 1387.0704 1391.4829 1426.7520 1441.9715 1444.5839 1457.4311 1468.6164 1472.4594 1478.0243 1478.7043 1481.4105 1486.6096 1487.1428 1497.2213 1502.2397 1522.1614 1550.3606 1591.6404 1596.4385 1616.6818 1617.8621 1641.1593 2841.4009 2867.2826 2958.6888 2975.7573 2983.0534 2993.7495 3011.0168 3015.8230 3023.1618 3039.9379 3048.3484 3071.2730 3075.3488 3079.2455 3088.7486 3091.2104 3122.1738 3127.1369 3139.2014 3150.8600 3152.4610 3157.9822 3166.8429 3463.7593 3548.6382 3697.9446
redmass: 3.9914 4.4771 4.6399 4.3861 4.2748 5.1227 3.8132 2.9446 5.0071 3.0076 4.4521 3.5092 5.1204 3.9679 5.5069 1.8165 3.4565 5.8590 1.2360 3.0611 3.1252 1.9491 2.7845 2.5238 3.3541 3.7154 4.4750 3.9724 3.4443 1.6543 2.4774 2.7967 3.3291 4.8968 2.4796 3.0863 2.3807 1.4028 3.0888 5.5730 5.0101 5.9269 5.5483 8.6457 4.6056 2.6146 1.5815 1.4531 3.7483 2.6004 2.9409 1.9196 2.2157 1.1346 1.2021 2.6811 2.3844 2.7466 1.2491 2.0240 1.5688 3.9410 1.4103 2.4840 1.3949 5.5928 1.5575 3.0929 1.5156 4.4338 2.1881 3.5471 1.7707 2.1455 2.1594 1.9526 1.5438 2.1367 1.6803 5.1448 2.0332 1.0558 1.8794 1.1219 1.1129 2.0820 2.2246 2.1945 1.4065 1.5267 1.2526 1.1362 3.1071 1.3250 1.4121 1.3277 1.2236 1.5696 1.3441 1.3106 1.2355 6.4700 1.2441 4.1775 5.0191 2.1896 1.1319 1.0635 1.0527 1.0614 1.0564 1.1827 1.0506 2.2195 1.0756 1.0762 2.9285 2.1799 7.1791 5.8945 6.0799 3.2923 2.5076 2.2798 1.0717 1.0707 1.0567 1.0348 1.0363 1.0603 1.0846 1.0626 1.1060 1.1005 1.0891 1.0989 1.0993 1.1007 1.1005 1.1040 1.0872 1.0869 1.0917 1.0963 1.0901 1.0917 1.1016 1.0800 1.0458 1.1033
irintensity: 0.0822 0.5484 2.8586 0.1291 1.0093 0.8162 2.4119 0.9066 0.4634 0.6324 0.4187 1.4676 2.3721 3.1230 0.5024 1.2335 1.5103 0.3370 0.5220 0.0977 2.0822 1.4920 2.8516 4.2599 2.3681 4.2603 27.3560 35.9836 18.1500 60.2554 8.2811 0.8932 4.0969 3.2655 49.5346 18.7244 27.1767 96.6450 15.7366 0.4948 1.7856 0.7964 1.2578 15.8628 59.4436 19.6454 76.1244 20.2445 21.3431 20.0271 2.3640 22.2190 29.3924 5.9504 9.5208 26.9993 35.1277 8.3207 0.1604 2.4830 27.1941 43.2034 17.0076 9.2603 0.0399 1.1385 4.3684 48.3805 0.6034 2.6767 7.1979 18.8391 14.5165 8.1135 33.5840 27.0546 3.1291 40.1498 8.2185 182.3109 74.8960 0.0857 25.6444 0.2661 3.9822 33.9576 5.6815 257.9045 40.6999 20.3636 9.6624 16.7323 103.7788 5.1142 15.2578 1.7533 12.3287 30.9490 2.2879 10.5696 22.2829 14.9497 24.1895 4.8485 33.2513 10.2183 26.3460 17.9171 9.8548 2.1112 2.2008 18.5857 7.1320 0.5515 19.0456 2.9629 310.9573 181.8926 11.9244 217.9104 3.4257 20.4129 17.7872 469.2093 74.4536 118.8289 32.9578 28.4546 29.8035 52.4098 25.5048 38.9403 24.1399 6.7899 13.1545 51.5270 58.4466 56.5560 41.5934 17.1069 6.3905 1.1632 12.2893 34.3971 11.3012 12.8581 18.9506 156.0544 122.4069 34.7206
temp: 298.150 k
press: 1.00000 atm
elementType: 17 8 8 7 7 7 6 6 6 6 6 6 6 6 6 6 6 6 6 6 6 6 6 6 6 6 1 1 1 1 1 1 1 1 1 1 1 1 1 1 1 1 1 1 1 1 1 1 1 1 1 1
symmnumber: 1
zpe: 1120078.5 jmol-1
zpe.correction: 0.426615 hartree
zpe.thermalcorrener: 0.452932 hartree
zpe.thermalcorrenthalpy: 0.453876 hartree
zpe.thermalcorrgfe: 0.366701 hartree
zpe.sumelectzpe: -1550.547861 hartree
zpe.sumelectthermal: -1550.521544 hartree
zpe.sumelectthermalent: -1550.520600 hartree
zpe.sumelectthermalfe: -1550.607775 hartree
dipole: 0.4326 8.0640 2.1237
dipole: 8.3502
quadrupole: -134.1663 -158.6622 -166.6406
quadrupole: 14.4655 1.6692 -6.8295
quadrupole: 18.9900 -5.5058 -13.4842 14.4655 1.6692 -6.8295
hfenergy: -1550.9744762 hartree
pointgroup: C01 [X(C20H26Cl1N3O2)]
dipole: 0.0327719 -3.2460555 0.5046472 debye
polarizability: 369.1210356|7.7207086|246.3810428|-30.968724|-51.878824|189.366047 unknown
InChI: InChI=1S/C20H26ClN3O2/c1-3-24(4-2)11-10-23-20(25)16-12-17(21)18(22)13-19(16)26-14-15-8-6-5-7-9-15/h5-9,12-13,23H,3-4,10-11,14,22H2,1-2H3
charge 0 multiplicity 1
52 atoms
Cl 5.891246 1.959944 -1.399021
O  1.178569 -1.163554 0.72971
O  0.776048 2.916102 -0.424339
N  -3.741691 2.305891 -0.439422
N  -0.273604 1.089962 0.558984
N  5.914281 -0.969623 -0.576832
C  -2.399446 1.711814 -0.625526
C  -1.563555 1.781341 0.682485
C  -4.210182 3.142216 -1.571181
C  -4.731301 1.345511 0.104268
C  -4.549571 2.3894 -2.88847
C  -5.983795 2.024008 0.690962
C  0.823292 1.709018 -0.005956
C  2.102594 0.912295 -0.103286
C  2.2987 -0.463804 0.231896
C  3.227334 1.619034 -0.60043
C  3.553434 -1.090059 0.076549
C  4.67582 -0.368554 -0.421759
C  1.257269 -2.630727 0.910204
C  4.466103 1.000682 -0.753113
C  -0.13826 -3.125676 1.222965
C  -0.388705 -3.882537 2.39253
C  -1.209739 -2.844384 0.336014
C  -1.689574 -4.362241 2.67101
C  -2.510757 -3.312425 0.618924
C  -2.753377 -4.076469 1.78569
H  -1.850005 2.276592 -1.399842
H  -2.447957 0.6485 -0.969046
H  -1.383819 2.842893 0.920592
H  -2.125412 1.326063 1.518244
H  -5.097453 3.712987 -1.239093
H  -3.420386 3.88995 -1.773006
H  -5.043672 0.585833 -0.658539
H  -4.228687 0.779253 0.911815
H  -0.171353 0.11335 0.854822
H  -3.672517 1.832649 -3.267068
H  -5.378553 1.671215 -2.74811
H  -4.856738 3.109077 -3.670305
H  -5.689028 2.779062 1.441045
H  -6.585906 2.527654 -0.086695
H  -6.632489 1.273639 1.17986
H  3.067646 2.669682 -0.863969
H  3.694762 -2.140522 0.347674
H  1.644309 -3.073445 -0.030813
H  1.958781 -2.866966 1.734103
H  0.430564 -4.093362 3.090758
H  -1.022158 -2.253254 -0.567989
H  6.695247 -0.422804 -0.933194
H  6.059145 -1.945561 -0.337946
H  -1.872486 -4.948379 3.578215
H  -3.333087 -3.086946 -0.069088
H  -3.762776 -4.442724 2.003116
