program: Gaussian 09
title: 000211483
version: EM64L-G09RevD.01
frameworkgroup: C1[X(C22H29NO)]
method: RPBEPBE
basis: SDD
operation: Freq
keyword: #p
keyword: freq=noraman
keyword: PBEPBE/SDD
title: #p freq=noraman PBEPBE/SDD
converged: YES YES NO NO
title: Mulliken charges:
elementType: O N C C C C C C C C C C C C C C C C C C C C C C H H H H H H H H H H H H H H H H H H H H H H H H H H H H H
charge: -0.270889 -0.118173 0.166025 -0.040791 -0.530015 -0.593764 0.350753 0.324906 -0.741656 -0.745593 -0.363685 -0.552215 -0.428639 -0.671369 0.296763 -0.589641 -0.395855 0.509362 -0.407802 -0.417055 -0.536041 -0.229760 -0.227560 -0.244202 0.206355 0.214818 0.218666 0.209731 0.236551 0.214531 0.209362 0.226003 0.225509 0.209367 0.226134 0.210525 0.222774 0.253239 0.230079 0.219773 0.190366 0.247870 0.205551 0.226959 0.240034 0.230310 0.231976 0.218272 0.218558 0.242238 0.222399 0.222549 0.226397
chargesum: 0.00000
title: Mulliken charges with hydrogens summed into heavy atoms:
elementType: O N C C C C C C C C C C C C C C C C C C C C C C
charge: -0.270889 -0.118173 0.166025 0.165563 -0.096532 -0.147482 0.350753 0.324906 -0.091760 -0.084583 0.069614 -0.298975 -0.198561 -0.013359 0.296763 -0.157131 -0.155821 0.509362 -0.177491 -0.185079 0.143027 -0.007361 -0.005011 -0.017805
polarizability: 3.12236766e+02 6.48307814e+00 2.67024776e+02 1.05030695e+01 8.61786620e+00 1.63288188e+02
1716.lowfreq: -1.7860 -0.0006 0.0003 0.0007 1.7171 7.9477 18.1281 22.0143 23.5899
frequency: 18.1049 21.8059 23.4826 40.2856 53.9062 75.2593 77.1605 106.5327 112.7009 138.1317 154.7137 188.0535 201.6760 210.1877 222.7365 235.5146 249.1555 263.0789 270.0619 290.5583 304.5569 312.5123 322.5159 340.6861 355.5404 378.0670 383.7896 403.0867 423.3423 451.0560 460.6311 481.8237 494.7988 510.7546 515.1855 556.8817 563.7969 604.8514 618.1955 622.7742 692.2373 704.9522 730.5566 749.8923 760.5636 779.2848 798.3415 812.7216 824.7783 852.1866 853.1876 878.2812 889.0411 892.7014 912.7751 916.6413 929.8472 936.7229 957.5753 974.2615 988.1172 989.8746 992.7557 1004.2546 1005.9330 1013.9779 1026.2590 1032.3905 1043.9465 1072.5087 1079.9256 1102.1655 1110.5016 1111.9739 1118.7285 1127.3405 1140.7725 1164.0946 1171.4866 1181.9311 1186.3912 1199.3795 1200.2650 1208.0195 1217.2728 1224.7776 1234.1557 1244.5511 1261.0354 1281.6872 1288.7494 1302.9255 1304.1349 1312.1063 1326.7387 1339.8239 1352.4970 1375.4014 1379.4117 1381.8875 1383.4490 1396.0302 1416.1076 1434.4913 1435.6579 1440.1824 1451.4562 1460.8318 1464.8451 1465.0791 1468.6323 1471.4751 1474.6108 1477.4401 1481.5580 1483.3769 1483.7355 1485.9264 1491.5706 1496.0334 1578.7693 1592.0820 1614.1837 1623.7995 2847.9613 2854.9789 2875.4748 2954.3394 2963.9255 2971.0809 2973.9268 2977.5486 2996.0774 3023.6288 3036.4716 3039.9233 3044.0158 3046.1106 3064.8145 3065.4303 3069.7749 3078.3434 3083.3380 3090.4627 3111.8108 3112.9775 3113.8542 3120.8606 3129.8326 3141.2918 3147.8540 3160.3232 3160.5076
redmass: 3.7155 4.7965 3.9725 3.6260 3.2114 3.4254 3.2798 3.2172 2.5569 3.4956 2.8614 3.5183 2.9595 1.2444 2.2074 1.1788 1.8327 1.8018 1.3657 1.9350 2.8037 2.5952 2.8325 2.9366 2.9659 2.5854 2.8479 2.8212 3.3695 2.9267 2.8107 2.8967 3.5141 3.2595 3.5953 2.7693 4.1195 4.0539 6.3630 3.9218 5.7836 1.7627 3.0724 2.8353 2.4711 1.2463 1.4334 3.5789 2.9717 1.7448 1.8180 2.0905 2.5021 1.6464 2.1759 1.5271 1.5040 1.4358 1.9720 1.3895 1.8326 6.2234 1.3452 1.7742 4.0640 1.6854 2.2321 2.8693 2.1080 2.1034 1.5771 1.7463 2.0580 1.2637 1.5251 1.5803 1.4442 1.3754 1.0533 1.9270 1.1144 1.9742 2.4307 2.2267 2.5033 2.8641 1.7249 1.8132 1.6575 1.4775 1.5548 1.4987 1.3927 1.3226 1.2518 1.5135 1.4194 1.2637 2.0851 7.4884 2.0765 1.2339 3.1172 1.1941 1.1993 2.0590 1.1073 1.0782 1.0630 1.0507 1.0913 1.0813 1.0728 1.0652 1.0730 1.1583 1.9764 1.1006 1.1532 2.0304 7.2542 6.0392 6.1798 6.8063 1.0756 1.0632 1.0707 1.0332 1.0619 1.0357 1.0494 1.0474 1.0608 1.0981 1.0723 1.1037 1.0890 1.0989 1.0992 1.0999 1.0984 1.0997 1.0992 1.0989 1.0869 1.0889 1.0867 1.0990 1.0907 1.0958 1.0905 1.0940 1.1013
irintensity: 0.0038 0.0185 0.0542 0.2320 0.1595 0.8545 6.5278 0.0024 0.0628 1.9337 1.2223 0.5305 0.3091 0.4424 2.1057 0.4113 0.2120 0.8537 0.9333 0.4146 1.1617 0.0649 1.0086 0.5784 5.6052 1.9998 1.7752 0.0195 0.6869 1.1694 3.0616 13.1584 0.9964 21.3586 1.6810 1.4205 13.2069 7.0521 0.0659 1.3518 3.6529 50.6595 1.4814 23.0605 23.0385 3.8099 30.9846 1.6011 4.3477 3.4705 4.4068 5.8203 2.1798 22.6204 8.5040 5.0290 0.7595 5.0168 10.4896 0.3148 30.9896 0.0850 3.6132 0.8578 79.7664 10.6525 1.0560 67.5950 21.8124 16.9782 4.0295 0.6539 8.8809 0.1458 4.8135 42.7835 3.5961 1.5291 0.3467 25.1867 0.2901 32.7277 15.1469 15.2674 1.9549 26.5449 15.1533 53.7421 33.6590 18.5955 22.8968 0.8518 16.7078 12.1875 0.9822 1.6921 32.8979 18.6441 6.6428 1.3748 1.6145 12.1481 45.5248 9.7766 4.0962 4.0421 4.4267 7.1629 1.8943 12.5786 4.8310 10.1922 43.6835 4.5751 10.3558 7.9809 18.3890 10.4126 51.7494 78.4709 26.0542 1.6207 12.6484 66.2404 46.4320 88.8598 112.5442 79.1087 24.5018 34.9975 18.6021 50.1445 27.5245 28.1491 45.1485 51.6363 10.2840 28.2850 8.5737 29.6364 80.6396 25.8826 46.6893 39.5505 9.6535 24.2189 7.9051 24.1446 11.5176 47.0115 7.8932 15.5204 27.2720
temp: 298.150 k
press: 1.00000 atm
elementType: 8 7 6 6 6 6 6 6 6 6 6 6 6 6 6 6 6 6 6 6 6 6 6 6 1 1 1 1 1 1 1 1 1 1 1 1 1 1 1 1 1 1 1 1 1 1 1 1 1 1 1 1 1
symmnumber: 1
zpe: 1195266.3 jmol-1
zpe.correction: 0.455253 hartree
zpe.thermalcorrener: 0.479092 hartree
zpe.thermalcorrenthalpy: 0.480036 hartree
zpe.thermalcorrgfe: 0.400162 hartree
zpe.sumelectzpe: -983.893132 hartree
zpe.sumelectthermal: -983.869293 hartree
zpe.sumelectthermalent: -983.868349 hartree
zpe.sumelectthermalfe: -983.948223 hartree
dipole: -0.1573 -0.6708 0.4078
dipole: 0.8007
quadrupole: -143.7114 -126.0429 -150.1021
quadrupole: 9.8226 5.1481 3.0792
quadrupole: -3.7592 13.9092 -10.1500 9.8226 5.1481 3.0792
hfenergy: -984.3483847 hartree
pointgroup: C01 [X(C22H29N1O1)]
dipole: -0.0605736 0.2726921 -0.1456144 debye
polarizability: 311.7076057|-6.3195627|266.0160958|-12.9203981|14.1902208|164.8260292 unknown
InChI: InChI=1S/C22H29NO/c1-22(2)16-19(14-18-10-11-20(24-4)15-21(18)22)23(3)13-12-17-8-6-5-7-9-17/h5-11,15,19H,12-14,16H2,1-4H3
charge 0 multiplicity 1
53 atoms
O  -5.900261 1.754388 -0.223361
N  1.273916 -1.704115 0.370086
C  -2.59829 -1.907876 -0.290633
C  -0.094236 -1.254137 -0.04688
C  -1.183284 -2.31141 0.231397
C  -0.483395 0.018087 0.743091
C  -2.914743 -0.427064 0.011903
C  -1.908618 0.477427 0.46594
C  -3.631465 -2.845736 0.398322
C  -2.669806 -2.135264 -1.832986
C  2.352815 -0.820189 -0.143612
C  -4.223826 0.060012 -0.20526
C  -2.257789 1.830781 0.684177
C  1.594164 -3.124664 0.113884
C  -4.557157 1.412771 0.027854
C  3.539067 -0.682259 0.853573
C  -3.566226 2.317757 0.478469
C  4.634868 0.217742 0.304636
C  5.636087 -0.298098 -0.559802
C  4.653042 1.605512 0.601479
C  -6.292255 3.144682 0.008635
C  6.626852 0.545491 -1.110692
C  5.641355 2.454475 0.053557
C  6.632431 1.926849 -0.806469
H  -0.105562 -1.02082 -1.142727
H  -0.931451 -3.27791 -0.241634
H  -1.224097 -2.481494 1.326933
H  0.213429 0.850408 0.530097
H  -0.354457 -0.227874 1.817207
H  -4.648174 -2.712586 -0.012088
H  -3.34503 -3.903533 0.243432
H  -3.675077 -2.654633 1.485938
H  -1.919231 -1.525185 -2.367022
H  -2.487705 -3.200247 -2.073717
H  -3.664509 -1.860106 -2.227002
H  2.744815 -1.184557 -1.125584
H  1.942512 0.187363 -0.331056
H  -5.021917 -0.600113 -0.5598
H  -1.482044 2.52764 1.026427
H  2.629201 -3.321354 0.444532
H  1.523453 -3.414367 -0.965461
H  0.937997 -3.790019 0.697793
H  3.945874 -1.688043 1.07201
H  3.135546 -0.284336 1.80224
H  -3.791654 3.372433 0.661979
H  5.6429 -1.370376 -0.794536
H  3.890736 2.019722 1.273692
H  -5.730915 3.838696 -0.647794
H  -6.142251 3.436446 1.066931
H  -7.36345 3.187397 -0.238449
H  7.394742 0.12786 -1.77223
H  5.642164 3.522656 0.299766
H  7.401708 2.582273 -1.230284
